program: Gaussian 09
title: 000236218
version: EM64L-G09RevD.01
frameworkgroup: C1[X(C12H4N2O2S2)]
method: RPBEPBE
basis: SDD
operation: Freq
keyword: #p
keyword: freq=noraman
keyword: PBEPBE/SDD
title: #p freq=noraman PBEPBE/SDD
converged: YES YES NO NO
title: Mulliken charges:
elementType: S S O O N N C C C C C C C C C C C C H H H H
charge: 0.395984 0.395976 -0.162462 -0.162470 0.045222 0.045224 0.286626 0.286599 0.155631 0.155658 -0.389088 -0.389070 -0.349235 -0.349236 -0.215943 -0.215939 -0.312130 -0.312133 0.294614 0.294614 0.250778 0.250778
chargesum: 0.00000
title: Mulliken charges with hydrogens summed into heavy atoms:
elementType: S S O O N N C C C C C C C C C C C C
charge: 0.395984 0.395976 -0.162462 -0.162470 0.045222 0.045224 0.286626 0.286599 0.155631 0.155658 -0.389088 -0.389070 -0.054620 -0.054622 0.034835 0.034840 -0.312130 -0.312133
polarizability: 2.35388424e+02 -6.25260732e-03 2.68905189e+02 -4.65472564e+00 -3.14111052e-05 8.53580242e+01
1716.lowfreq: -8.0749 -3.5165 -1.9616 -0.0017 -0.0009 0.0019 21.7874 31.8060 45.5829
frequency: 21.5718 31.8058 45.5790 46.3881 108.1636 110.7785 133.4248 162.5501 182.5345 212.3313 269.1115 269.9853 295.1780 312.0703 351.4325 363.5519 372.1487 396.0608 411.0651 434.4416 438.1963 474.7843 516.8099 535.8828 615.4057 620.3724 627.6190 687.5072 692.1402 715.5822 771.3806 804.0517 806.4702 836.8668 848.9024 933.2567 1000.6819 1018.8409 1020.1693 1075.8384 1077.0373 1118.7948 1177.4295 1235.7644 1265.9737 1286.1303 1403.7713 1439.2360 1471.8526 1522.3386 1547.9115 1554.3929 1594.1244 1604.5961 2113.3525 2113.5957 3146.0288 3158.5306 3168.0506 3178.3539
redmass: 15.2873 14.1965 10.1010 12.0127 6.3550 13.9706 7.2794 8.4845 17.2253 9.4169 7.8258 9.3212 13.4657 14.2859 12.7232 12.5554 11.2171 10.2409 5.0819 5.7315 6.8360 13.2807 7.6995 6.8371 16.3410 14.4526 8.4920 6.7448 5.9821 3.1645 7.7114 10.9101 1.6360 4.1887 6.9395 1.5917 1.3956 1.3737 3.4809 2.8068 4.4596 2.4628 1.0690 2.2366 4.6995 1.9776 10.2697 2.3981 2.6653 10.0139 11.7032 10.3447 8.0654 6.7588 12.7526 12.7528 1.0869 1.0904 1.0951 1.1008
irintensity: 0.0090 2.0597 6.1840 0.1042 0.3829 4.9276 0.0142 0.4258 4.2538 0.3434 0.2851 0.0058 2.3004 1.5452 0.5037 0.9158 18.5681 6.6116 4.2115 4.2658 0.7200 3.4168 0.8870 2.4165 0.3677 9.0453 7.7675 0.1114 0.0027 62.7947 40.9872 35.5869 35.6607 0.4894 4.4683 0.6243 3.0709 0.0209 11.4226 13.8616 25.5887 142.6655 5.6713 34.7888 396.4240 12.4717 0.8625 3.0255 8.5453 161.5938 49.4120 228.3470 2.0906 3.1909 7.7841 14.4242 3.1029 2.3021 0.1512 19.8438
temp: 298.150 k
press: 1.00000 atm
elementType: 16 16 8 8 7 7 6 6 6 6 6 6 6 6 6 6 6 6 1 1 1 1
symmnumber: 1
zpe: 333448.3 jmol-1
zpe.correction: 0.127004 hartree
zpe.thermalcorrener: 0.143250 hartree
zpe.thermalcorrenthalpy: 0.144195 hartree
zpe.thermalcorrgfe: 0.080645 hartree
zpe.sumelectzpe: -1514.450233 hartree
zpe.sumelectthermal: -1514.433987 hartree
zpe.sumelectthermalent: -1514.433043 hartree
zpe.sumelectthermalfe: -1514.496592 hartree
dipole: -4.9361 -0.0003 -2.0058
dipole: 5.3281
quadrupole: -92.9523 -152.5602 -120.8508
quadrupole: 0.0029 -8.4068 -0.0020
quadrupole: 29.1688 -30.4391 1.2703 0.0029 -8.4068 -0.0020
hfenergy: -1514.577237 hartree
pointgroup: C01 [X(C12H4N2O2S2)]
dipole: -2.0216878 0.0019938 0.5540869 debye
dipolederiv: 0.0075212 -0.2760299 0.0891336 -0.2540145 -0.1809668 0.0160059 0.0098438 -0.0658981 0.2050992 0.0084245 0.2756734 0.0887997 0.2536974 -0.1818277 -0.0157281 0.0096463 0.0662624 0.2050459 -0.638222 -0.0008609 -0.0173082 -0.0621341 -0.9037398 -0.1059176 -0.0444742 -0.0098705 -0.2806365 -0.6381431 0.0004358 -0.0171339 0.0615796 -0.903727 0.1066885 -0.0445079 0.0105881 -0.280751 -0.2132586 -0.0555602 0.0259093 -0.1091267 -0.2682665 0.0019854 0.0769776 0.0523331 -0.1674634 -0.2129995 0.0555018 0.0258511 0.1091543 -0.2685944 -0.0019225 0.0768023 -0.0523603 -0.1674081 -0.5552724 -0.2235865 -0.0959517 -0.3091582 -0.0527462 -0.0796048 -0.1369765 -0.0439744 -0.0140781 -0.5544138 0.2242839 -0.0960578 0.309828 -0.0534489 0.0797801 -0.1371684 0.0442339 -0.0142028 1.4357577 -0.3584336 0.1655493 -0.1224087 0.945647 0.1057168 0.2567899 -0.1537847 0.2372282 1.4365986 0.357854 0.1649428 0.1219594 0.9449411 -0.1067484 0.2568097 0.1526185 0.2371494 -0.1551277 1.0725094 -0.0318039 1.082951 0.0907039 0.1825329 -0.0431862 0.0921433 -0.0854939 -0.1587073 -1.0720704 -0.0308421 -1.0825625 0.0936972 -0.1827388 -0.0420048 -0.0922259 -0.0852095 -0.19536 0.1219011 -0.0212071 -0.1496101 0.1006177 -0.0235295 -0.0411708 0.0245689 -0.0883742 -0.1953262 -0.1214437 -0.0210285 0.1500476 0.1005716 0.0233362 -0.0413774 -0.0247169 -0.0883686 0.1967724 -0.1553903 0.0808254 -0.0159655 -0.0290614 -0.0076083 0.0852208 -0.0421155 -0.1031731 0.1970548 0.1551157 0.0806608 0.0156969 -0.0292819 0.0073942 0.0852873 0.0418962 -0.1032251 0.0295009 0.0626103 -0.1389155 0.0859351 0.2198753 -0.1025779 -0.1112915 -0.0345089 -0.0008056 0.0292616 -0.0624301 -0.138698 -0.0857903 0.2202828 0.102587 -0.1111594 0.0344754 -0.0009513 0.1303189 -0.0488493 -0.0102053 0.0187944 0.0203578 0.0063953 -0.0015173 -0.0090893 0.1517986 0.1303815 0.0486604 -0.010272 -0.0189772 0.0203156 -0.0062233 -0.0015089 0.009243 0.1517881 -0.0422657 0.0644886 -0.0461455 0.0762275 0.0572324 0.018729 -0.0505482 0.0188355 0.1459943 -0.0424958 -0.0643794 -0.0461023 -0.0761235 0.0574182 -0.0185518 -0.0504862 -0.0186539 0.1460377 unknown
polarizability: 232.1998484|0.0469419|268.9050803|22.1333653|-0.1195828|88.5467084 unknown
InChI: InChI=1S/C12H4N2O2S2/c13-5-17-11-9(15)7-3-1-2-4-8(7)10(16)12(11)18-6-14/h1-4H
charge 0 multiplicity 1
22 atoms
S  2.541293 1.600685 0.85718
S  2.538639 -1.606027 0.859145
O  -0.272575 2.739681 0.398963
O  -0.276973 -2.740987 0.401902
N  2.542115 3.9788 -0.87468
N  2.535611 -3.98592 -0.870279
C  -1.514739 0.71128 -0.02985
C  -1.515902 -0.711049 -0.02902
C  -0.278871 1.478423 0.292247
C  -0.281294 -1.479818 0.29403
C  0.985365 0.687352 0.482927
C  0.984227 -0.690583 0.483753
C  -2.705036 1.418248 -0.325164
C  -2.707346 -1.416418 -0.323532
C  -3.888117 0.710221 -0.623818
C  -3.889273 -0.706807 -0.623002
C  2.435032 3.003217 -0.188349
C  2.430184 -3.009447 -0.184959
H  -2.680651 2.512256 -0.314565
H  -2.68474 -2.510451 -0.311669
H  -4.807501 1.257398 -0.855252
H  -4.809546 -1.252754 -0.853806
