program: Gaussian 09
title: 000236215
version: EM64L-G09RevD.01
frameworkgroup: C1[X(C12H11Cl2N3O)]
method: RPBEPBE
basis: SDD
operation: Freq
keyword: #p
keyword: freq=noraman
keyword: PBEPBE/SDD
title: #p freq=noraman PBEPBE/SDD
converged: YES YES NO NO
title: Mulliken charges:
elementType: Cl Cl O N N N C C C C C C C C C C C C H H H H H H H H H H H
charge: -0.080879 -0.053259 -0.269562 -0.427450 -0.034936 -0.626394 -0.710831 0.123353 0.300900 0.651248 -0.013410 -0.802812 -0.362746 -0.361136 0.135659 -0.220184 -0.233146 -0.104995 0.276004 0.231760 0.309570 0.230627 0.252065 0.278002 0.302818 0.280077 0.259653 0.358017 0.311987
chargesum: 0.00000
title: Mulliken charges with hydrogens summed into heavy atoms:
elementType: Cl Cl O N N N C C C C C C C C C C C C
charge: -0.080879 -0.053259 -0.269562 -0.117880 -0.034936 0.043610 -0.203067 0.123353 0.300900 0.651248 -0.013410 -0.042118 -0.362746 -0.058318 0.135659 0.059893 0.026508 -0.104995
polarizability: 2.21407858e+02 -4.68954078e+00 1.74963848e+02 4.05147006e+00 -1.21189351e+01 1.23556819e+02
1716.lowfreq: -14.4332 -2.9258 0.0019 0.0025 0.0028 6.2561 25.8553 32.0570 58.8312
frequency: 25.7425 32.0428 58.7673 78.7019 105.3409 122.3802 156.8318 164.5936 172.6176 182.1907 192.3471 241.2502 283.4890 298.1322 307.6031 340.5135 358.5651 369.1339 414.4839 422.2814 441.8747 497.2455 515.5632 523.9995 547.7350 562.0384 573.0998 583.2114 610.9611 635.3420 672.4824 697.7394 717.8276 751.6362 796.8366 817.3056 842.8340 859.9767 871.3531 933.5105 976.2472 985.1332 1015.7483 1043.7199 1047.9141 1078.6885 1092.2674 1137.2268 1161.6996 1197.4191 1216.1359 1219.0620 1270.6462 1310.8350 1323.1202 1363.0718 1377.1121 1382.5743 1408.5245 1445.0755 1454.2786 1462.4626 1472.0870 1479.2553 1550.2103 1564.2059 1591.9570 1593.1634 1634.8531 1659.3637 2975.9410 3007.3601 3048.2632 3078.5284 3127.7559 3139.8800 3174.3647 3183.7732 3533.8823 3553.6199 3705.2136
redmass: 6.2471 6.5524 4.9205 7.5380 1.4676 2.6554 12.0667 5.9877 3.2537 8.0947 12.3909 1.1184 4.4721 4.7170 4.4261 3.1646 4.5978 8.3135 6.1268 3.3528 3.4140 5.8994 5.7767 1.1301 4.4049 4.3126 1.2276 4.0232 6.2778 6.2580 5.9628 7.8315 6.0954 6.3936 5.4465 3.2133 1.7426 1.4111 2.1763 2.1334 2.3977 1.5607 4.3653 1.5674 1.5229 2.2809 2.8572 1.7626 3.1278 2.5991 2.4996 1.8856 1.3344 1.6065 1.6956 3.3003 5.0080 3.0404 1.3346 1.9874 2.2596 1.7093 1.1432 1.0522 7.0276 7.7191 4.7700 1.7450 2.3242 6.0853 1.0406 1.0626 1.0979 1.0978 1.0948 1.0917 1.0952 1.0935 1.0772 1.0460 1.1052
irintensity: 6.8835 1.3606 2.6499 10.0652 0.5258 0.5633 1.0565 0.0228 0.1631 0.8434 2.3143 66.1434 0.4681 2.0067 3.2861 1.7313 6.3315 9.8044 19.8028 2.9843 4.8423 2.7570 5.8120 317.0783 12.8646 3.6270 30.8107 6.3707 1.7312 16.6328 17.1601 5.6542 34.6093 0.7478 15.6126 42.1043 23.0552 20.9722 3.8468 1.6854 17.5464 1.8542 56.2143 10.6758 2.7514 23.5098 4.6332 11.9981 5.8977 6.2682 17.2118 5.7838 0.7025 56.3486 32.2284 6.6379 5.9795 35.3931 37.8352 100.2973 127.1961 106.7985 66.2021 35.8197 413.1183 56.6667 34.1534 23.6914 387.2561 284.7419 29.0550 10.4098 17.5954 7.6227 1.0107 11.8331 3.0691 0.3926 21.3249 111.6823 43.0455
temp: 298.150 k
press: 1.00000 atm
elementType: 17 17 8 7 7 7 6 6 6 6 6 6 6 6 6 6 6 6 1 1 1 1 1 1 1 1 1 1 1
symmnumber: 1
zpe: 555200.2 jmol-1
zpe.correction: 0.211465 hartree
zpe.thermalcorrener: 0.228695 hartree
zpe.thermalcorrenthalpy: 0.229639 hartree
zpe.thermalcorrgfe: 0.165038 hartree
zpe.sumelectzpe: -1622.208105 hartree
zpe.sumelectthermal: -1622.190874 hartree
zpe.sumelectthermalent: -1622.189930 hartree
zpe.sumelectthermalfe: -1622.254531 hartree
dipole: -5.3871 4.1252 -6.1620
dipole: 9.1656
quadrupole: -98.3895 -121.4487 -118.6535
quadrupole: -8.8048 25.4548 2.9319
quadrupole: 14.4411 -8.6182 -5.8229 -8.8048 25.4548 2.9319
hfenergy: -1622.4195692 hartree
pointgroup: C01 [X(C12H11Cl2N3O1)]
dipole: 2.4199497 -2.3089521 1.3475678 debye
polarizability: 221.7149588|4.6834908|125.6587245|3.9726406|-15.3684672|172.554842 unknown
InChI: InChI=1S/C12H11Cl2N3O/c1-6-9(11(18)17-12(15)16-6)4-7-2-3-8(13)5-10(7)14/h2-3,5,16H,4,15H2,1H3
charge 0 multiplicity 1
29 atoms
Cl -1.99654 -0.328434 3.059205
Cl -5.053803 -1.793332 -1.311711
O  1.270092 1.866258 -1.500786
N  3.162484 -1.177153 0.421695
N  3.106802 0.425701 -1.357393
N  4.882327 -1.087327 -1.210714
C  0.025383 0.978605 0.903759
C  1.314992 0.355973 0.382262
C  1.963539 -0.698639 0.993839
C  -1.239047 0.28548 0.396287
C  1.879061 0.938406 -0.875618
C  1.52365 -1.445539 2.229642
C  -2.199449 -0.334087 1.22941
C  -1.509017 0.26011 -1.002111
C  3.69125 -0.583636 -0.72498
C  -3.359435 -0.971182 0.740962
C  -2.655801 -0.362981 -1.534638
C  -3.563634 -0.976654 -0.649949
H  0.015651 2.018996 0.528158
H  0.019602 1.016808 2.005249
H  3.633569 -1.96433 0.871169
H  2.347734 -1.520774 2.965246
H  1.201608 -2.473758 1.974143
H  0.673238 -0.95236 2.719878
H  -0.798693 0.76385 -1.667173
H  -4.074906 -1.437836 1.421737
H  -2.841273 -0.363992 -2.612181
H  5.245882 -0.643391 -2.050953
H  5.399235 -1.845182 -0.773837
