program: Gaussian 09
title: 000236209
version: EM64L-G09RevD.01
frameworkgroup: C1[X(C22H23NO)]
method: RPBEPBE
basis: SDD
operation: Freq
keyword: #p
keyword: freq=noraman
keyword: PBEPBE/SDD
title: #p freq=noraman PBEPBE/SDD
converged: YES YES NO NO
title: Mulliken charges:
elementType: O N C C C C C C C C C C C C C C C C C C C C C C H H H H H H H H H H H H H H H H H H H H H H H
charge: -0.479239 -0.176624 0.159016 -0.440970 -0.420146 0.390879 0.524793 -0.368085 0.306031 -0.401506 -0.390277 -0.706333 -0.432989 -0.373244 -0.350300 -0.258472 -0.222963 -0.229167 -0.239689 -0.245656 -0.181259 -0.248945 -0.359824 -0.181858 0.218004 0.209935 0.176977 0.221080 0.230589 0.368203 0.219066 0.284262 0.206484 0.218328 0.204210 0.222918 0.246569 0.244511 0.218840 0.219950 0.221524 0.220600 0.222006 0.241877 0.224366 0.250117 0.236411
chargesum: 0.00000
title: Mulliken charges with hydrogens summed into heavy atoms:
elementType: O N C C C C C C C C C C C C C C C C C C C C C C
charge: -0.111037 -0.176624 0.159016 -0.222966 -0.033233 0.390879 0.524793 0.083584 0.306031 -0.182440 -0.106015 -0.077310 -0.210071 -0.126675 -0.105789 -0.039632 -0.003014 -0.007644 -0.019089 -0.023649 0.060617 -0.024579 -0.109707 0.054553
polarizability: 2.83668610e+02 2.69674804e+01 2.16203189e+02 -1.10613910e+01 6.05592141e+00 2.09275925e+02
1716.lowfreq: -9.1793 -7.4676 -0.0010 -0.0007 -0.0006 3.7878 25.0690 30.9508 44.4274
frequency: 24.2032 30.5860 44.4099 47.1622 52.6962 63.6305 68.4053 81.9807 97.1037 139.7889 166.7118 216.3384 221.1118 236.4055 244.0221 252.3515 261.3331 282.9091 299.8188 318.3215 362.4306 402.2237 403.6446 404.2132 455.1885 468.3007 478.6858 514.1035 563.5821 611.6926 616.6360 617.6070 623.1997 646.4296 688.9001 700.1528 704.7010 741.8686 745.9848 751.4080 758.9986 769.6797 802.2643 824.9592 832.0795 841.3839 849.0321 856.2327 865.3395 896.7883 906.7156 915.2662 924.3139 940.1393 963.0600 970.5780 975.9782 983.1596 987.9194 990.1203 991.5456 992.0665 1001.4744 1003.4023 1026.0029 1028.4066 1041.1710 1043.7175 1064.2861 1082.7236 1086.9111 1095.7573 1113.4318 1124.6460 1167.7769 1169.1776 1170.6637 1183.8105 1187.8343 1194.4623 1200.2454 1208.2978 1237.9206 1247.9240 1265.0229 1285.8721 1295.6465 1304.5317 1311.5826 1330.6920 1342.2265 1352.1526 1380.9829 1383.0624 1388.1867 1414.9699 1431.4632 1440.2791 1452.1228 1457.7205 1471.0444 1475.7819 1478.4082 1480.1411 1486.4368 1489.1144 1563.1837 1588.3189 1590.9748 1591.3627 1609.1784 1613.1364 2965.5320 2968.2054 2993.5667 3004.1998 3019.5977 3041.7707 3046.1265 3067.8736 3070.7881 3106.6798 3116.4334 3121.9042 3124.4797 3135.0684 3136.3219 3138.3190 3142.4355 3154.3340 3155.4584 3157.6689 3169.2972 3175.9807 3179.3101
redmass: 4.0454 4.5198 3.9183 4.4714 4.2242 3.5438 4.2164 3.1891 2.0290 4.4375 3.7642 4.1944 4.0275 2.4230 1.7013 4.3551 3.8579 4.7536 3.0810 5.1034 4.0598 2.8188 3.2469 2.9325 4.1204 3.8499 3.4909 3.3520 4.8443 5.2938 5.5560 5.8354 5.8628 4.7323 5.1214 1.6310 1.6803 2.4200 2.1067 1.3081 1.6898 1.9519 3.0134 1.7291 1.7567 2.2166 1.3224 1.3402 1.7132 1.5665 1.7644 1.4974 1.5015 2.2370 1.4523 1.4013 1.3833 4.0252 2.9093 6.0923 2.2890 2.1004 1.4730 1.3509 2.3106 2.2626 2.5360 3.1066 2.2611 1.6700 1.8676 1.6531 2.0698 2.0280 1.0755 1.0556 1.0691 1.1358 2.3439 1.1466 1.8145 2.0782 1.5277 1.9496 1.7017 1.3722 1.2546 2.0162 1.4096 1.5620 1.4308 1.5102 8.0501 6.8042 1.2164 1.9133 2.1489 2.1440 1.4850 1.6282 1.3281 1.0699 1.0551 2.2020 1.3751 1.3921 5.9273 5.7461 6.0904 6.0187 6.0360 6.1354 1.0406 1.0544 1.0618 1.0830 1.0966 1.0978 1.0703 1.0985 1.1024 1.0860 1.0853 1.0869 1.0875 1.0933 1.0871 1.0934 1.0903 1.0990 1.0974 1.0954 1.0972 1.1013 1.0946
irintensity: 0.0440 0.9946 0.2294 0.8910 0.1176 0.3181 0.4759 0.4773 0.6709 1.8857 2.5893 3.1285 0.5432 0.8788 1.3645 0.4218 1.3381 0.2594 0.2222 3.6169 5.1065 0.0654 1.3844 0.5556 1.9789 4.1422 3.1038 2.1517 10.1011 5.4959 8.3392 5.7264 13.1697 19.3389 0.2868 83.2593 40.0353 5.8517 61.7402 12.3956 59.2556 8.3898 19.9609 21.6049 68.5293 8.5605 17.3191 1.9525 23.8217 3.1139 14.0486 1.5825 4.8341 9.1322 0.3902 1.0258 1.0313 2.9626 8.8941 0.0660 1.5748 0.2404 1.0866 0.0716 7.1812 9.7942 4.8532 9.3949 5.5827 8.2038 6.3860 10.0600 13.1277 17.8664 2.5709 0.8639 0.0810 3.7069 0.0337 0.1329 5.9346 6.7651 8.1335 12.5157 3.6917 3.0546 4.0958 10.1338 2.7052 4.1910 1.8778 1.4467 1.5970 0.4822 9.8228 48.7341 4.1564 7.6699 98.9929 20.3996 58.1361 7.3905 14.9556 20.7291 27.4308 10.5101 17.5393 53.9017 2.0678 4.5267 4.1957 4.6244 29.8663 34.7639 17.3131 15.6114 42.0597 63.7225 592.8361 51.7598 68.0468 12.7781 5.4822 3.0359 2.1386 36.1090 6.0394 36.1930 7.3976 28.4773 39.3488 18.7875 7.0086 18.0532 5.9901
temp: 298.150 k
press: 1.00000 atm
elementType: 8 7 6 6 6 6 6 6 6 6 6 6 6 6 6 6 6 6 6 6 6 6 6 6 1 1 1 1 1 1 1 1 1 1 1 1 1 1 1 1 1 1 1 1 1 1 1
symmnumber: 1
zpe: 1020611.1 jmol-1
zpe.correction: 0.388730 hartree
zpe.thermalcorrener: 0.410234 hartree
zpe.thermalcorrenthalpy: 0.411178 hartree
zpe.thermalcorrgfe: 0.336558 hartree
zpe.sumelectzpe: -980.400094 hartree
zpe.sumelectthermal: -980.378590 hartree
zpe.sumelectthermalent: -980.377646 hartree
zpe.sumelectthermalfe: -980.452266 hartree
dipole: 3.8723 -0.7336 2.6189
dipole: 4.7320
quadrupole: -119.8577 -144.9794 -133.5758
quadrupole: 4.5524 -1.8729 2.6559
quadrupole: 12.9466 -12.1751 -0.7715 4.5524 -1.8729 2.6559
hfenergy: -980.7888245 hartree
pointgroup: C01 [X(C22H23N1O1)]
dipole: 1.5424634 -0.0576272 1.0408691 debye
polarizability: 275.1340753|34.949564|225.0325035|-11.9844155|4.4134183|208.981144 unknown
InChI: InChI=1S/C22H23NO/c1-2-16-22(24,19-13-7-4-8-14-19)21(18-11-5-3-6-12-18)20-15-9-10-17-23-20/h3-15,17,21,24H,2,16H2,1H3
charge 0 multiplicity 1
47 atoms
O  -0.060942 0.887719 -1.690381
N  2.473657 0.716298 -0.853906
C  -0.394377 0.960273 -0.265631
C  0.560168 -0.021307 0.55534
C  -0.193449 2.426742 0.237946
C  -1.852366 0.509682 -0.095412
C  0.325225 -1.506253 0.235924
C  -1.071912 3.457329 -0.503649
C  2.039806 0.328846 0.392129
C  -2.5076 0.625129 1.157646
C  -2.563283 -0.039802 -1.187858
C  -0.74882 4.907423 -0.084447
C  -0.356629 -2.321983 1.174201
C  0.769941 -2.092745 -0.977173
C  2.948716 0.217126 1.473889
C  -3.844099 0.197619 1.316071
C  -3.901637 -0.466399 -1.032668
C  -0.59834 -3.688182 0.909555
C  0.529016 -3.45876 -1.243707
C  -4.548498 -0.351383 0.218973
C  4.315848 0.498316 1.269233
C  -0.155163 -4.26304 -0.303158
C  3.794148 0.991691 -1.046112
C  4.75364 0.893115 -0.016626
H  0.30755 0.125442 1.622951
H  0.871391 2.701842 0.10062
H  -0.398046 2.483662 1.327236
H  -2.139914 3.241751 -0.309599
H  -0.917133 3.329179 -1.591311
H  0.956377 0.924538 -1.719538
H  -1.982718 1.057647 2.019135
H  -2.045652 -0.121517 -2.147091
H  0.306661 5.160664 -0.302303
H  -1.386559 5.631933 -0.623891
H  -0.91196 5.0584 1.000295
H  -0.716712 -1.879755 2.111456
H  1.299385 -1.482088 -1.714034
H  2.58087 -0.09605 2.456279
H  -4.336277 0.295666 2.290884
H  -4.43878 -0.890523 -1.889095
H  -1.133591 -4.299499 1.645038
H  0.87379 -3.895912 -2.188027
H  -5.586457 -0.682571 0.339529
H  5.028511 0.412368 2.096356
H  -0.340469 -5.322774 -0.512479
H  4.0793 1.299752 -2.057843
H  5.804785 1.119595 -0.218043
