program: Gaussian 09
title: 000236203
version: EM64L-G09RevD.01
frameworkgroup: C1[X(C25H21NO2)]
method: RPBEPBE
basis: SDD
operation: Freq
keyword: #p
keyword: freq=noraman
keyword: PBEPBE/SDD
title: #p freq=noraman PBEPBE/SDD
converged: YES YES NO NO
title: Mulliken charges:
elementType: O O N C C C C C C C C C C C C C C C C C C C C C C C C C H H H H H H H H H H H H H H H H H H H H H
charge: -0.235843 -0.245005 -0.458723 -0.310687 0.260504 0.093100 0.132063 -0.624623 0.214661 0.062813 -0.416362 -0.814319 0.146954 -0.361317 0.303132 -0.271723 -0.219326 0.294376 -0.336552 -0.364277 -0.335347 -0.351484 -0.260487 -0.238044 -0.230252 -0.252476 -0.229705 -0.222966 0.276442 0.292144 0.249833 0.299247 0.267965 0.281025 0.229413 0.244171 0.226695 0.221072 0.219566 0.265278 0.276476 0.252701 0.276462 0.234180 0.231008 0.231888 0.230582 0.232844 0.232928
chargesum: 0.00000
title: Mulliken charges with hydrogens summed into heavy atoms:
elementType: O O N C C C C C C C C C C C C C C C C C C C C C C C C C
charge: -0.235843 -0.245005 -0.159476 -0.034245 0.260504 0.093100 0.132063 -0.082647 0.214661 0.062813 -0.148398 -0.059711 0.146954 -0.134623 0.303132 -0.050651 0.000240 0.294376 -0.071274 -0.087801 -0.082646 -0.075022 -0.026307 -0.007036 0.001636 -0.021894 0.003139 0.009961
polarizability: 3.32189540e+02 4.55429775e+00 2.76941641e+02 8.74951324e+00 -4.61666196e+01 2.42782473e+02
1716.lowfreq: -7.5504 -5.1579 -3.9763 0.0004 0.0004 0.0006 6.0978 17.0399 26.0823
frequency: 5.4991 16.6612 26.0198 30.6871 38.7042 52.2811 61.7229 85.8825 100.7825 120.8922 133.0938 136.5419 153.5887 154.9710 165.5475 201.6570 235.9118 268.8572 283.2735 296.6243 343.1061 356.1884 399.5534 399.8082 409.0187 424.5032 432.1207 435.0269 450.5806 485.3608 493.5309 507.4882 540.0986 555.3461 577.7145 580.3178 613.2820 613.4406 627.7508 648.6794 652.8876 671.5552 673.5372 696.0260 696.2742 742.8413 751.7200 752.3557 764.9793 781.5472 797.1291 835.7801 855.4834 859.3589 859.5715 867.6906 914.5597 931.9863 936.1356 949.7449 961.4513 974.8765 975.7207 989.3420 989.9074 991.8216 993.3217 995.4603 1007.0689 1009.2754 1011.3986 1014.6932 1026.3140 1032.2540 1042.3529 1079.5579 1086.1218 1089.4096 1110.4307 1146.9674 1167.7239 1172.5924 1173.1539 1188.2858 1192.6743 1192.8605 1205.9158 1220.9435 1234.3892 1241.6606 1268.3128 1285.5192 1305.7743 1313.0112 1320.7523 1334.5214 1347.9972 1386.4774 1387.6691 1400.4425 1414.0027 1421.3956 1434.3645 1435.6324 1440.7961 1464.9392 1473.0502 1478.8099 1479.2164 1480.7379 1482.5472 1554.4412 1566.3560 1576.0414 1591.0452 1593.1453 1597.2639 1608.7527 1611.8729 1631.2810 2949.8669 2960.8407 2968.3745 3036.1720 3038.2772 3110.3645 3122.1149 3127.8450 3128.6454 3130.1081 3138.9868 3140.3597 3143.0541 3150.3275 3152.8989 3159.9598 3160.6651 3163.3642 3169.9066 3174.1893 3600.9088
redmass: 4.9315 4.8493 5.6990 4.7044 4.1156 4.6699 6.5631 2.1338 2.2989 5.1157 3.1989 3.5515 5.2430 3.9834 4.8925 4.5590 3.0889 5.4052 3.3794 3.4735 7.1103 5.5401 2.8296 2.8180 3.2372 4.9802 4.5603 3.1204 5.7986 5.4609 4.0968 1.2330 4.2685 2.8037 3.7615 3.7610 6.4118 6.4300 6.5529 5.4182 6.2998 4.4773 5.7417 1.7960 1.8168 2.7591 1.4783 2.3266 3.4231 2.4663 2.6767 4.0930 1.4121 1.2758 1.2504 4.9413 4.7107 1.6598 1.3850 1.5544 2.4136 2.4383 1.4237 4.0913 5.5985 1.3945 1.5946 1.9026 2.0678 1.4919 1.6192 2.0865 2.1415 2.0047 1.4642 2.2496 1.6140 1.8950 1.8888 1.9807 1.1032 1.0684 1.0663 1.1299 1.3696 1.1920 1.6373 1.9915 1.8990 1.9541 2.1079 1.7497 3.5157 1.4449 1.3446 1.6612 1.7817 9.0635 9.2209 2.3379 1.8885 2.3158 2.1500 2.1735 1.1970 3.9983 1.2837 1.0659 2.1884 2.1745 2.3716 7.8315 6.7104 6.4101 6.0026 6.3875 6.6654 6.1070 6.2245 6.6740 1.0781 1.0670 1.0405 1.0976 1.0921 1.0946 1.0850 1.0853 1.0851 1.0892 1.0882 1.0889 1.0952 1.0926 1.0933 1.0960 1.1000 1.0970 1.1011 1.0981 1.0803
irintensity: 0.1615 0.5991 1.2961 1.2520 0.4589 1.0928 3.6935 2.2784 0.6705 0.2714 0.4930 3.0811 0.4725 0.2808 2.5141 2.4057 0.1524 24.4277 6.5119 0.7726 2.9546 1.8312 0.0106 0.1280 0.3468 1.8326 0.4817 6.1055 1.1177 0.1709 13.2296 50.4816 95.2042 12.1155 23.6652 6.4535 0.0553 0.4517 9.2142 5.2940 1.4757 2.2646 1.8824 64.1380 32.9752 32.0803 81.3511 60.1711 8.1641 17.4607 35.2270 3.4435 0.9705 1.3236 0.1547 4.1257 7.4462 15.5895 8.1567 2.4340 13.6759 8.0146 0.8146 0.2369 0.7745 0.4259 0.2472 13.1904 35.0284 8.1962 11.4012 14.4800 0.2533 2.3940 4.1010 7.3487 16.4281 0.0310 2.7999 46.5754 18.1236 2.7943 3.7431 53.4252 7.1010 14.4841 53.0866 21.4282 17.6510 3.0779 362.0150 85.7114 32.3537 4.4327 22.8820 49.1092 21.5744 3.4082 3.0353 8.2124 31.1430 19.4045 30.4958 7.6154 29.9083 22.2696 10.9513 24.4133 1.5036 1.8735 4.1063 145.9854 80.5554 10.7615 3.1023 34.9360 15.8545 14.3608 8.4939 3.7879 24.2542 140.4636 46.0282 20.1507 5.6082 5.1056 0.3551 0.5764 0.1302 7.8873 6.9299 10.6448 23.9642 20.1054 12.8431 16.4457 35.6381 26.8637 24.4904 11.2166 48.4640
temp: 298.150 k
press: 1.00000 atm
elementType: 8 8 7 6 6 6 6 6 6 6 6 6 6 6 6 6 6 6 6 6 6 6 6 6 6 6 6 6 1 1 1 1 1 1 1 1 1 1 1 1 1 1 1 1 1 1 1 1 1
symmnumber: 1
zpe: 1019126.4 jmol-1
zpe.correction: 0.388165 hartree
zpe.thermalcorrener: 0.412347 hartree
zpe.thermalcorrenthalpy: 0.413291 hartree
zpe.thermalcorrgfe: 0.329766 hartree
zpe.sumelectzpe: -1168.544948 hartree
zpe.sumelectthermal: -1168.520766 hartree
zpe.sumelectthermalent: -1168.519822 hartree
zpe.sumelectthermalfe: -1168.603347 hartree
dipole: -0.7142 1.1931 3.3296
dipole: 3.6083
quadrupole: -130.1389 -164.8041 -150.4572
quadrupole: -2.2415 0.2359 2.0460
quadrupole: 18.3279 -16.3374 -1.9905 -2.2415 0.2359 2.0460
hfenergy: -1168.9331127 hartree
pointgroup: C01 [X(C25H21N1O2)]
dipole: -0.0836012 -0.2871608 -1.3877583 debye
polarizability: 332.6662847|3.2886227|288.9964493|5.8715208|-39.7198095|230.2509206 unknown
InChI: InChI=1S/C25H21NO2/c1-17-24(20-14-8-9-15-22(20)26-17)21(25(28)19-12-6-3-7-13-19)16-23(27)18-10-4-2-5-11-18/h2-15,21,26H,16H2,1H3
charge 0 multiplicity 1
49 atoms
O  -0.630479 2.991674 -0.526871
O  1.664355 -0.063523 2.045389
N  -1.267478 -1.780825 -2.624258
C  -0.189974 0.649003 0.042287
C  -0.610321 -0.51064 -0.84769
C  -0.712764 -1.896397 -0.417183
C  -0.949048 -0.473015 -2.208315
C  1.304048 1.027852 -0.110001
C  -1.134728 -2.671595 -1.553208
C  -1.105073 1.883062 -0.128659
C  -0.482346 -2.553786 0.820846
C  -1.021018 0.667746 -3.185628
C  2.177573 0.492061 1.026178
C  -1.340093 -4.066181 -1.483656
C  -2.566641 1.769605 0.203496
C  -0.689157 -3.945656 0.897471
C  -1.115417 -4.693515 -0.239897
C  3.668172 0.653268 0.923365
C  -3.143316 0.603037 0.77632
C  -3.39338 2.901793 -0.037647
C  4.286924 1.349086 -0.150501
C  4.482051 0.096169 1.947387
C  -4.51665 0.574149 1.097959
C  -4.765377 2.869388 0.278491
C  -5.331753 1.703359 0.848672
C  5.690805 1.483586 -0.197595
C  5.883398 0.227547 1.897917
C  6.492047 0.922293 0.824119
H  -0.313933 0.30757 1.092969
H  1.39117 2.135206 -0.141529
H  1.701998 0.666479 -1.075958
H  -1.55554 -2.029808 -3.568326
H  -0.122533 -1.991293 1.690185
H  -0.603597 1.587442 -2.748461
H  -0.451893 0.446251 -4.109257
H  -2.065266 0.888216 -3.482805
H  -1.660685 -4.646208 -2.356624
H  -0.511998 -4.46801 1.844188
H  -1.265273 -5.775144 -0.147359
H  -2.532685 -0.284166 0.965558
H  -2.929766 3.795752 -0.467802
H  3.678946 1.793474 -0.945148
H  3.986109 -0.432109 2.768385
H  -4.951025 -0.328376 1.541222
H  -5.392788 3.747057 0.087858
H  -6.398487 1.676023 1.098742
H  6.160392 2.024541 -1.026374
H  6.502826 -0.206967 2.690097
H  7.582268 1.026122 0.784945
