program: Gaussian 09
title: 000236202
version: EM64L-G09RevD.01
frameworkgroup: C1[X(C14H11Cl2NO3)]
method: RPBEPBE
basis: SDD
operation: Freq
keyword: #p
keyword: freq=noraman
keyword: PBEPBE/SDD
title: #p freq=noraman PBEPBE/SDD
converged: YES YES NO NO
title: Mulliken charges:
elementType: Cl Cl O O O N C C C C C C C C C C C C C C H H H H H H H H H H H
charge: 0.061199 0.013017 -0.215872 -0.404913 -0.215115 -0.204497 0.212798 0.178876 0.235919 0.132240 -0.363278 -0.321930 -0.661290 -0.810994 0.116401 -0.225283 -0.278619 -0.207451 -0.118153 0.185117 0.240061 0.250215 0.248881 0.260862 0.248932 0.320727 0.237893 0.237422 0.227713 0.228910 0.390212
chargesum: 0.00000
title: Mulliken charges with hydrogens summed into heavy atoms:
elementType: Cl Cl O O O N C C C C C C C C C C C C C C
charge: 0.061199 0.013017 -0.215872 -0.014700 -0.215115 -0.204497 0.212798 0.178876 0.235919 0.132240 -0.123218 -0.071715 0.097386 -0.014952 0.116401 0.002431 -0.049708 -0.207451 -0.118153 0.185117
polarizability: 2.45009052e+02 7.01539719e+00 2.09023303e+02 5.35457195e+00 7.30680094e-01 1.42886626e+02
1716.lowfreq: -6.3660 -4.4800 -0.0025 -0.0014 -0.0004 5.2824 17.2555 26.6400 37.1413
frequency: 17.1708 26.6154 37.1275 43.4556 89.5522 95.8100 97.5983 121.5283 130.8732 139.5275 159.8176 178.6986 189.4371 229.0876 253.2550 267.1196 311.1938 318.9884 320.2403 330.1944 349.8195 397.8763 411.4831 435.5661 486.5701 512.6873 553.9445 573.3976 578.9417 598.0284 626.4444 638.7991 669.1740 706.2180 714.2941 727.9000 755.1520 759.4164 784.4347 805.0568 855.3324 898.5688 936.8010 946.2350 979.9466 986.1963 1022.2185 1029.2277 1044.8944 1071.2896 1087.7856 1119.9430 1135.8610 1157.2785 1169.8142 1217.0139 1267.3809 1311.6104 1318.8207 1361.3041 1393.8194 1409.2397 1414.8101 1436.9303 1451.7140 1466.0594 1471.3321 1478.8933 1497.5923 1499.0833 1523.7945 1528.8340 1588.4264 1602.5455 1618.2527 1625.7096 2972.3301 2990.7005 3046.1358 3069.4278 3116.2651 3130.0127 3133.5910 3145.6381 3162.8558 3180.6148 3524.6088
redmass: 6.5768 9.7192 13.5448 8.6491 1.2730 12.7690 2.2354 7.6187 2.0488 3.8255 1.3755 7.8694 13.1103 8.3734 4.0576 8.0986 9.0877 3.2401 3.6282 6.7431 8.8485 8.0963 15.9432 2.9335 5.5722 5.1604 4.9854 3.9359 3.6801 1.3948 5.2317 4.6777 6.3609 5.2602 6.8904 9.1432 1.4246 4.6590 5.3945 6.6126 1.4863 3.9839 1.3973 8.8439 1.3198 3.5752 2.4364 2.2866 1.5093 2.1950 2.9694 1.3213 1.4982 2.5169 1.1901 3.0518 2.3667 2.5474 2.0582 3.5376 1.3930 2.5344 4.0710 1.1697 2.6778 2.3764 1.0421 1.6179 1.1055 1.3888 6.7145 4.8921 6.8612 11.7338 9.1308 7.4758 1.0396 1.0364 1.0971 1.1018 1.0965 1.0972 1.0858 1.0908 1.0969 1.0965 1.0642
irintensity: 2.2213 0.4690 0.9126 0.8409 0.0243 0.0194 0.2434 0.1620 1.5508 3.5778 0.4774 2.7945 1.5589 1.9988 1.4271 2.1736 1.5832 1.0419 0.5931 1.0866 14.3139 1.7322 1.2967 3.9104 9.3750 78.5461 5.7184 34.8776 26.9103 106.6427 10.0403 11.5050 6.5043 6.9126 31.0522 11.8561 113.8717 20.6560 20.7571 66.6326 0.4568 4.5636 0.7291 4.3512 0.1654 14.0664 27.0723 10.7033 1.7300 428.0950 91.4477 0.4207 11.7730 27.3111 10.8656 36.0385 21.4270 92.3576 16.5697 9.4212 17.5886 170.5800 22.9980 84.5078 14.7071 0.7279 25.3984 75.0590 9.6092 26.7903 77.7075 550.5515 10.7120 76.1627 143.2115 6.4644 35.7084 49.3396 12.4474 16.6833 4.4236 6.3851 0.0860 12.0194 25.8083 11.5473 58.6032
temp: 298.150 k
press: 1.00000 atm
elementType: 17 17 8 8 8 7 6 6 6 6 6 6 6 6 6 6 6 6 6 6 1 1 1 1 1 1 1 1 1 1 1
symmnumber: 1
zpe: 573245.9 jmol-1
zpe.correction: 0.218338 hartree
zpe.thermalcorrener: 0.237915 hartree
zpe.thermalcorrenthalpy: 0.238859 hartree
zpe.thermalcorrgfe: 0.167674 hartree
zpe.sumelectzpe: -1739.195714 hartree
zpe.sumelectthermal: -1739.176137 hartree
zpe.sumelectthermalent: -1739.175193 hartree
zpe.sumelectthermalfe: -1739.246378 hartree
dipole: -6.3445 1.4177 -1.5582
dipole: 6.6851
quadrupole: -96.4833 -126.4804 -135.8538
quadrupole: 10.8887 -3.1669 -0.8385
quadrupole: 23.1226 -6.8746 -16.2480 10.8887 -3.1669 -0.8385
hfenergy: -1739.4140518 hartree
pointgroup: C01 [X(C14H11Cl2N1O3)]
dipole: -2.4810892 0.6096796 -0.6244868 debye
polarizability: 245.261355|6.2412472|208.7366673|5.6984608|0.3365845|142.9209578 unknown
InChI: InChI=1S/C14H11Cl2NO3/c1-7-10(13(18)11(15)12(16)14(19)20)8-5-3-4-6-9(8)17(7)2/h3-6,19H,1-2H3
charge 0 multiplicity 1
31 atoms
Cl 2.060493 -0.322213 2.349783
Cl 2.177183 -0.819447 -2.079168
O  0.672878 -2.788729 0.471882
O  4.657114 0.454763 -1.429639
O  4.462472 0.707965 0.870378
N  -2.987966 -0.538686 -0.170979
C  -2.419003 0.753292 -0.11173
C  -1.011458 0.606685 0.116898
C  -1.998632 -1.49748 0.011001
C  -0.75015 -0.834626 0.193758
C  -3.057039 2.002591 -0.242691
C  -0.224566 1.782705 0.217883
C  -4.417039 -0.780028 -0.391138
C  -2.304133 -2.965974 -0.003871
C  0.511112 -1.524059 0.401857
C  -2.249037 3.154049 -0.139301
C  -0.849954 3.040275 0.088909
C  1.778752 -0.694148 0.602665
C  2.669828 -0.373204 -0.38039
C  3.982953 0.301959 -0.21526
H  -4.134724 2.085952 -0.417332
H  0.852283 1.732966 0.394793
H  -4.736569 -0.349081 -1.357024
H  -4.617814 -1.860734 -0.405975
H  -5.015179 -0.321536 0.416957
H  -1.370534 -3.526339 0.147403
H  -3.012641 -3.242344 0.80074
H  -2.750763 -3.2791 -0.967143
H  -2.703789 4.145838 -0.234902
H  -0.24489 3.949844 0.167622
H  5.525511 0.907043 -1.250085
