program: Gaussian 09
title: 000236200
version: EM64L-G09RevD.01
frameworkgroup: C1[X(C13H9Cl2NO3)]
method: RPBEPBE
basis: SDD
operation: Freq
keyword: #p
keyword: freq=noraman
keyword: PBEPBE/SDD
title: #p freq=noraman PBEPBE/SDD
converged: YES YES NO NO
title: Mulliken charges:
elementType: Cl Cl O O O N C C C C C C C C C C C C C H H H H H H H H H
charge: 0.062939 0.014857 -0.209835 -0.404432 -0.214408 -0.440950 0.167158 0.138556 0.213187 0.230917 -0.323406 -0.370882 -0.795689 0.117001 -0.279410 -0.210936 -0.206794 -0.117562 0.186925 0.316663 0.249678 0.235254 0.239286 0.316347 0.236701 0.229104 0.228913 0.390819
chargesum: 0.00000
title: Mulliken charges with hydrogens summed into heavy atoms:
elementType: Cl Cl O O O N C C C C C C C C C C C C C
charge: 0.062939 0.014857 -0.209835 -0.013613 -0.214408 -0.124287 0.167158 0.138556 0.213187 0.230917 -0.073727 -0.135628 -0.003355 0.117001 -0.050307 0.017976 -0.206794 -0.117562 0.186925
polarizability: 2.20111124e+02 6.29432239e+00 2.01748116e+02 5.30257487e+00 2.14957648e+00 1.34666144e+02
1716.lowfreq: -76.8791 -4.2603 -0.0020 -0.0019 0.0017 1.8602 6.5560 22.1030 27.7492
frequency: -76.8750 22.0839 27.7473 37.9912 43.6171 95.8940 103.3900 122.5953 139.6942 181.8369 189.6907 227.4915 259.0821 282.8473 288.6175 313.3246 324.8538 346.3476 398.5516 412.0677 431.6745 482.5927 487.3573 555.0680 573.5667 591.5891 615.1745 621.5678 628.8440 633.0599 671.4557 708.6223 724.4552 754.0340 756.5181 770.4004 801.2081 855.7527 856.5719 937.3580 937.7600 951.3939 980.3230 1005.2038 1022.8897 1045.1058 1046.3567 1071.0907 1116.2118 1168.8655 1193.4641 1239.8974 1261.4304 1311.7939 1325.7084 1339.8093 1393.9658 1413.1330 1419.1273 1456.7330 1460.8787 1486.4054 1489.3564 1529.5493 1542.4030 1590.8337 1603.7312 1618.7035 1633.0348 2975.3259 3048.4432 3124.9677 3132.5184 3143.9901 3162.8426 3181.2255 3525.3037 3581.9542
redmass: 1.0457 7.1578 8.0245 11.9494 8.7508 12.7123 4.3742 7.8483 5.0351 8.6220 11.4741 8.8623 6.9528 4.2462 4.8939 6.9247 5.9296 10.9024 8.0575 14.9058 2.9229 4.6731 5.5264 4.6480 3.3078 1.4831 1.4142 2.9825 4.8010 4.5854 5.9785 5.1866 10.3510 2.2904 2.3998 4.8626 9.0570 4.1763 1.5738 3.8056 1.5477 11.0186 1.3206 1.6175 2.0907 7.5361 1.5588 2.1889 1.8551 1.2513 2.1380 1.4248 3.6686 2.6186 1.7978 3.6711 1.3846 2.9834 2.8001 1.7160 3.2130 2.4755 1.0470 8.7078 4.6062 6.3078 11.6759 9.2074 7.0000 1.0398 1.0972 1.0962 1.0862 1.0909 1.0967 1.0965 1.0642 1.0804
irintensity: 0.0024 2.5459 0.8779 1.0022 0.7652 0.0149 0.4787 0.0391 3.4083 2.0584 1.6151 1.8575 0.2702 3.0508 2.0064 0.6579 0.7281 14.4774 2.9493 0.9389 4.6977 44.5379 0.3008 84.7961 8.1817 90.7005 50.8526 49.9844 31.0305 6.7999 3.5446 5.0034 29.0506 119.5908 21.2431 39.2459 53.6310 0.5029 1.0687 0.5102 0.9588 5.9600 0.2507 16.3281 4.9489 48.1288 4.4462 431.2299 7.5966 20.0530 54.4819 19.6822 23.6275 88.0611 14.6016 15.7560 16.5334 26.1060 202.1861 3.3262 81.5375 22.7713 15.7185 423.3481 145.6793 12.2784 78.1438 140.7657 2.5708 34.5359 12.4333 3.0257 0.6878 11.8253 26.1842 10.9734 58.9958 68.4644
temp: 298.150 k
press: 1.00000 atm
elementType: 17 17 8 8 8 7 6 6 6 6 6 6 6 6 6 6 6 6 6 1 1 1 1 1 1 1 1 1
symmnumber: 1
zpe: 501273.1 jmol-1
zpe.correction: 0.190925 hartree
zpe.thermalcorrener: 0.208069 hartree
zpe.thermalcorrenthalpy: 0.209014 hartree
zpe.thermalcorrgfe: 0.143287 hartree
zpe.sumelectzpe: -1699.976978 hartree
zpe.sumelectthermal: -1699.959833 hartree
zpe.sumelectthermalent: -1699.958889 hartree
zpe.sumelectthermalfe: -1700.024616 hartree
dipole: -5.6747 1.1523 -1.6039
dipole: 6.0086
quadrupole: -92.0472 -118.5329 -129.8299
quadrupole: 11.7440 -1.9367 -0.6761
quadrupole: 21.4228 -5.0629 -16.3599 11.7440 -1.9367 -0.6761
hfenergy: -1700.1679027 hartree
pointgroup: C01 [X(C13H9Cl2N1O3)]
dipole: -2.2076031 0.5072878 -0.6763274 debye
polarizability: 220.073658|5.776246|201.4371649|7.3764791|2.9205754|135.0145615 unknown
InChI: InChI=1S/C13H9Cl2NO3/c1-6-9(7-4-2-3-5-8(7)16-6)12(17)10(14)11(15)13(18)19/h2-5,16,18H,1H3
charge 0 multiplicity 1
28 atoms
Cl 1.738706 -0.297403 2.408717
Cl 2.083661 -0.697975 -2.017911
O  0.586334 -2.804691 0.418205
O  4.447434 0.713917 -1.23408
O  4.133811 0.910191 1.058366
N  -3.159178 -0.773361 -0.329991
C  -1.29329 0.489101 0.068204
C  -0.937645 -0.935487 0.122409
C  -2.697781 0.552449 -0.218918
C  -2.126804 -1.67486 -0.12965
C  -0.590549 1.710872 0.232341
C  -3.411231 1.75965 -0.348855
C  -2.368618 -3.153484 -0.203163
C  0.356234 -1.551158 0.370692
C  -1.291884 2.927601 0.104887
C  -2.684891 2.956993 -0.182721
C  1.560324 -0.650642 0.64498
C  2.470941 -0.255325 -0.291613
C  3.730637 0.496837 -0.055002
H  -4.12224 -1.041544 -0.530907
H  0.478397 1.726239 0.457107
H  -4.484106 1.774612 -0.569497
H  -2.727988 -3.449452 -1.207636
H  -1.432408 -3.690055 0.00477
H  -3.131539 -3.47147 0.53317
H  -0.752445 3.872274 0.231851
H  -3.198681 3.919737 -0.275061
H  5.277397 1.215136 -1.008496
