program: Gaussian 09
title: 000236144
version: EM64L-G09RevD.01
frameworkgroup: C1[X(C14H26N2O)]
method: RPBEPBE
basis: SDD
operation: Freq
keyword: #p
keyword: freq=noraman
keyword: PBEPBE/SDD
title: #p freq=noraman PBEPBE/SDD
converged: YES YES NO NO
title: Mulliken charges:
elementType: O N N C C C C C C C C C C C C C C H H H H H H H H H H H H H H H H H H H H H H H H H H
charge: -0.307439 -0.185160 -0.436618 0.225697 -0.286960 -0.701979 -0.700086 -0.712588 0.268801 -0.483121 -0.479209 0.506545 0.500189 -0.815858 -0.810650 -0.712658 -0.715050 0.214571 0.213728 0.202201 0.206286 0.245154 0.204200 0.208382 0.232208 0.210179 0.220642 0.210276 0.285489 0.216592 0.250419 0.226482 0.229268 0.228352 0.220279 0.231394 0.222177 0.223657 0.253543 0.225869 0.214819 0.232764 0.217215
chargesum: 0.00000
title: Mulliken charges with hydrogens summed into heavy atoms:
elementType: O N N C C C C C C C C C C C C C C
charge: -0.307439 -0.185160 -0.183075 0.225697 0.141339 -0.048339 -0.055296 -0.071491 0.268801 0.018960 -0.002308 0.506545 0.500189 -0.137960 -0.133423 -0.271971 -0.265070
polarizability: 1.87611011e+02 -2.28513639e+00 1.58694084e+02 9.52402002e-01 1.96010338e+00 1.61535070e+02
1716.lowfreq: -9.9114 -6.2579 -0.0003 0.0005 0.0007 5.6101 17.6165 26.1720 34.6049
frequency: 15.7521 26.0147 34.5939 45.8128 62.6629 69.2678 73.5453 78.7522 110.1759 134.5367 157.7893 170.2008 186.6054 197.8929 214.6849 229.8804 241.2216 251.2936 288.5343 306.3002 323.1783 338.9626 359.9952 379.1025 404.7997 411.0048 411.6986 415.0553 448.7997 462.3500 519.8250 594.8626 625.0618 629.5003 668.8825 691.7948 694.6461 746.4324 805.3074 829.8880 837.0049 909.9353 921.2542 923.7427 927.1521 932.1683 934.9286 940.5816 947.2461 948.0884 956.2686 962.1741 967.2477 1000.6728 1002.2540 1019.9111 1028.0848 1048.4983 1051.9892 1054.7525 1116.8760 1178.1802 1198.5146 1216.3322 1229.6125 1250.7246 1253.1622 1271.6264 1290.4909 1301.4434 1345.5870 1349.4199 1363.4423 1372.4781 1374.6088 1391.6869 1392.6745 1395.2828 1405.4210 1415.9112 1419.7397 1441.2897 1453.7092 1455.0744 1461.2126 1461.9382 1463.0246 1466.2087 1468.7708 1472.3202 1474.2653 1481.7674 1482.5790 1497.0158 1643.4134 1678.8916 1682.1533 2941.8609 2956.0742 2961.0035 2963.0963 2968.6849 2972.8468 2975.0011 2978.1462 3006.5403 3025.3769 3031.9711 3033.9380 3042.3788 3060.6628 3065.8052 3067.6886 3074.7892 3087.3684 3088.0711 3088.7812 3091.7663 3095.5377 3096.6105 3198.7026 3199.5662 3461.1750
redmass: 2.9273 3.6870 3.3235 3.2973 3.2464 2.9899 5.5634 3.5532 2.8160 2.2671 1.0743 1.0582 1.2220 3.4356 3.0575 1.4582 1.0496 1.6666 3.2762 2.8968 2.1164 3.2410 2.5642 2.5550 2.0700 2.2383 2.1437 2.1632 2.2887 2.6623 3.8210 2.6228 1.2955 4.1702 4.0123 1.0477 1.1960 3.5124 4.0775 4.0042 3.4883 2.5269 2.0021 1.5490 1.7900 1.4968 1.5532 1.2642 1.2154 1.6773 1.6184 1.7257 1.5984 1.4324 1.4232 2.1594 1.7593 1.6480 1.4426 1.5858 2.1700 1.3304 2.2138 1.9529 2.2537 2.0416 2.2100 2.9417 1.9228 1.8375 1.3950 1.5713 1.5625 1.2102 1.2017 1.2241 1.2054 1.6678 1.3923 1.1947 1.2130 1.0749 1.1135 1.0506 1.0471 1.0799 1.0481 1.0522 1.0468 1.0592 1.0643 1.0656 1.0589 1.0686 6.2570 5.1402 5.0917 1.0543 1.0602 1.0385 1.0409 1.0353 1.0356 1.0642 1.0368 1.1079 1.0954 1.0966 1.0965 1.0947 1.1000 1.0994 1.0990 1.0984 1.0995 1.0979 1.0978 1.0988 1.0621 1.0623 1.1142 1.1142 1.0773
irintensity: 0.0186 0.2959 0.0691 0.3340 0.5585 0.3998 1.2929 0.8109 2.7374 0.3065 0.2927 0.2108 0.1704 0.3513 1.1807 0.1661 0.1162 0.2925 3.0498 0.5605 0.2220 6.0744 8.5207 6.0132 0.8967 17.9828 6.3723 4.0572 1.4311 10.1497 3.5171 19.4954 61.7953 24.7083 3.4037 4.1117 3.8359 1.1952 19.4029 10.3527 6.2253 5.4906 1.4598 36.5745 1.5661 30.2680 12.9036 1.6535 1.0408 13.6616 12.3425 47.1467 84.7489 7.2599 5.1981 198.1829 77.4759 20.1468 2.5464 12.9608 105.7168 0.2293 37.3367 216.0920 85.5253 13.7900 12.7605 6.9713 5.0740 50.7821 2.4893 0.9283 15.6724 24.6742 19.2580 6.3199 19.9302 87.2354 2.3152 8.9817 8.8609 25.4449 15.9044 0.2822 13.7136 1.4613 13.4798 0.7112 0.0164 32.0063 13.6275 7.8921 11.8120 25.2307 345.5772 30.8780 17.8372 35.0042 17.8003 21.4880 62.1604 36.8181 42.0671 45.3874 15.7920 28.8869 9.3333 23.2652 24.8860 8.6783 5.2117 55.6821 17.3811 69.2981 4.4471 23.9201 29.9561 66.2748 6.8366 5.7163 29.8336 18.8204 10.5645
temp: 298.150 k
press: 1.00000 atm
elementType: 8 7 7 6 6 6 6 6 6 6 6 6 6 6 6 6 6 1 1 1 1 1 1 1 1 1 1 1 1 1 1 1 1 1 1 1 1 1 1 1 1 1 1
symmnumber: 1
zpe: 981661.1 jmol-1
zpe.correction: 0.373895 hartree
zpe.thermalcorrener: 0.395657 hartree
zpe.thermalcorrenthalpy: 0.396602 hartree
zpe.thermalcorrgfe: 0.321375 hartree
zpe.sumelectzpe: -732.390715 hartree
zpe.sumelectthermal: -732.368952 hartree
zpe.sumelectthermalent: -732.368008 hartree
zpe.sumelectthermalfe: -732.443235 hartree
dipole: 1.5211 1.2333 0.8599
dipole: 2.1388
quadrupole: -95.9262 -106.7998 -107.6618
quadrupole: -5.7843 -1.8255 0.0183
quadrupole: 7.5364 -3.3372 -4.1992 -5.7843 -1.8255 0.0183
hfenergy: -732.7646095 hartree
pointgroup: C01 [X(C14H26N2O1)]
dipole: -0.6340322 0.3498117 -0.4285724 debye
polarizability: 186.9451753|5.0243919|158.6935714|0.4670077|-1.1939357|162.2014182 unknown
InChI: InChI=1S/C14H26N2O/c1-11(2)8-16(9-12(3)4)13(15)17-10-14(5,6)7/h15H,1,3,8-10H2,2,4-7H3
charge 0 multiplicity 1
43 atoms
O  -1.110114 -0.542349 0.128049
N  1.134574 -0.028769 0.213948
N  0.350955 -1.600231 1.794939
C  -3.541239 -0.726807 -0.107578
C  -2.296194 -1.237884 0.653286
C  -3.718114 0.793642 0.139892
C  -3.388812 -1.007177 -1.624826
C  -4.768442 -1.497834 0.447405
C  0.12412 -0.790778 0.790701
C  2.504034 -0.152395 0.735037
C  0.883799 0.981673 -0.821815
C  3.490606 -0.874854 -0.183079
C  0.674226 2.413717 -0.319002
C  4.940746 -0.749837 0.247695
C  0.613637 3.455444 -1.421719
C  3.103524 -1.587695 -1.27139
C  0.541831 2.72099 0.99631
H  -2.175814 -2.332091 0.507401
H  -2.399198 -1.025904 1.738416
H  -3.881576 1.004901 1.213911
H  -4.592276 1.176038 -0.418948
H  -2.82188 1.351082 -0.1831
H  -3.265935 -2.089389 -1.821145
H  -4.286057 -0.661084 -2.170528
H  -2.507741 -0.483763 -2.034346
H  -4.671086 -2.588198 0.284036
H  -5.689777 -1.161956 -0.062484
H  -4.901017 -1.321288 1.531979
H  2.434226 -0.699377 1.694607
H  2.896113 0.862242 0.959201
H  0.000268 0.681343 -1.413361
H  1.747312 0.969662 -1.518337
H  5.613006 -1.319049 -0.416088
H  5.079689 -1.126414 1.280593
H  5.269084 0.308687 0.248686
H  0.422876 4.464198 -1.018606
H  -0.189313 3.219139 -2.148288
H  1.561334 3.487031 -1.995513
H  -0.457052 -2.146619 2.127291
H  2.046275 -1.674499 -1.545531
H  3.830816 -2.113912 -1.900027
H  0.583084 1.945276 1.768813
H  0.383895 3.752789 1.330317
