program: Gaussian 09
title: 000236141
version: EM64L-G09RevD.01
frameworkgroup: C1[X(C10H22N2O)]
method: RPBEPBE
basis: SDD
operation: Freq
keyword: #p
keyword: freq=noraman
keyword: PBEPBE/SDD
title: #p freq=noraman PBEPBE/SDD
converged: YES YES NO NO
title: Mulliken charges:
elementType: O N N C C C C C C C C C C H H H H H H H H H H H H H H H H H H H H H H
charge: -0.296082 -0.120731 -0.426483 -0.382054 -0.370126 -0.344991 -0.346913 -0.337538 -0.336825 0.209563 -0.698071 -0.695352 -0.530370 0.242103 0.196566 0.232133 0.198385 0.237873 0.178652 0.221688 0.187434 0.186547 0.201497 0.190498 0.195939 0.208436 0.213136 0.215739 0.211131 0.214688 0.212961 0.241337 0.227718 0.239715 0.221801
chargesum: 0.00000
title: Mulliken charges with hydrogens summed into heavy atoms:
elementType: O N N C C C C C C C C C C
charge: -0.296082 -0.120731 -0.185146 0.056615 0.060391 0.071533 0.062208 0.050506 0.049612 0.209563 -0.060761 -0.056572 0.158864
polarizability: 1.45998160e+02 -4.88896271e-01 1.39857603e+02 -5.32767740e+00 -2.64198292e+00 1.01470404e+02
1716.lowfreq: -10.8562 -4.5403 -0.0002 0.0005 0.0009 4.1364 25.3717 39.7441 51.2532
frequency: 25.1916 39.5354 51.1810 58.8742 66.8534 70.1666 102.7073 108.0280 115.5887 149.8704 189.7197 212.4001 227.2673 229.4357 242.4964 267.0536 322.9662 367.7534 385.5047 392.5777 441.1646 566.5343 592.1455 625.2313 664.4347 734.0185 735.2897 756.0649 787.5378 790.6137 891.3686 898.9816 906.4042 923.9801 934.6302 1009.8244 1014.1381 1033.2988 1068.5002 1072.6562 1074.9511 1106.6884 1111.1193 1112.6100 1114.2031 1145.9636 1168.7738 1205.6061 1215.9073 1253.7880 1264.0944 1268.2332 1276.1328 1286.1546 1291.4617 1314.6764 1339.3292 1344.0128 1361.2392 1369.2768 1383.2980 1389.0378 1389.7253 1433.4996 1446.3765 1462.0840 1466.3346 1467.1246 1469.2890 1475.0881 1475.5184 1476.5845 1476.6692 1478.0127 1486.6764 1487.3034 1654.1532 2960.5169 2960.7721 2961.3436 2971.1430 2972.3047 2973.0456 2974.7333 2982.2780 2988.6203 3005.0918 3008.5868 3039.7554 3041.9884 3048.9146 3064.4610 3067.5700 3070.0380 3071.3533 3072.5402 3074.4385 3123.2854 3449.8470
redmass: 3.6679 2.5901 3.4081 1.6541 2.0501 3.1047 3.2681 2.4050 2.3821 3.1952 1.1029 2.4053 1.3421 1.1160 2.3965 3.3867 3.5448 3.1911 2.5713 2.6885 3.5360 3.2709 4.0318 1.1623 8.7062 1.0799 1.0775 3.9280 1.2396 1.2188 2.2263 1.7276 2.0375 1.2216 1.3027 3.8683 3.2614 3.3095 2.2373 2.4122 2.1839 1.6316 2.1683 1.6450 1.7146 1.4527 2.2231 1.9125 1.5809 1.7643 1.2966 1.2811 1.3360 1.1074 1.0943 1.3812 1.4584 1.4725 1.3652 1.3538 1.8377 1.2182 1.2162 1.2336 1.0797 1.0537 1.0755 1.0844 1.0969 1.0601 1.0554 1.0442 1.0506 1.0761 1.0788 1.0813 5.9315 1.0586 1.0588 1.0333 1.0576 1.0418 1.0416 1.0562 1.0653 1.0653 1.0973 1.0964 1.0980 1.0967 1.1039 1.1023 1.1005 1.1000 1.0995 1.1010 1.1019 1.0990 1.0769
irintensity: 0.0110 0.2332 2.1597 0.0490 1.1110 0.7784 2.1853 0.1375 0.3885 0.2691 0.1322 1.6870 0.4766 0.1134 2.0874 0.6304 8.7881 2.1610 8.0102 0.3516 20.1729 4.1428 29.7508 89.1010 7.4458 8.3639 16.2207 19.2179 0.5414 2.1173 2.2386 15.2196 4.3700 3.0554 25.5126 22.0719 10.9524 168.6549 29.5677 13.0519 18.8867 27.9679 8.8223 7.7104 8.8704 54.0143 55.6105 20.1531 55.9883 35.4149 2.9192 0.8925 45.3875 10.2777 6.6951 34.3495 0.5290 0.6272 17.8538 11.2105 40.1817 13.5930 4.7828 40.5606 13.7781 13.4567 2.8509 4.0697 8.1849 8.8092 16.5143 13.9804 8.7890 6.5471 13.8404 17.5242 387.5306 29.8075 27.9575 52.9178 20.7947 22.5957 48.3837 15.2188 83.0760 44.9249 11.1761 13.8710 15.0756 8.5330 45.2052 0.2313 11.7668 100.1903 54.6990 30.3803 124.6621 18.5358 8.8118
temp: 298.150 k
press: 1.00000 atm
elementType: 8 7 7 6 6 6 6 6 6 6 6 6 6 1 1 1 1 1 1 1 1 1 1 1 1 1 1 1 1 1 1 1 1 1 1
symmnumber: 1
zpe: 816425.1 jmol-1
zpe.correction: 0.310960 hartree
zpe.thermalcorrener: 0.328243 hartree
zpe.thermalcorrenthalpy: 0.329187 hartree
zpe.thermalcorrgfe: 0.263821 hartree
zpe.sumelectzpe: -577.878610 hartree
zpe.sumelectthermal: -577.861328 hartree
zpe.sumelectthermalent: -577.860383 hartree
zpe.sumelectthermalfe: -577.925749 hartree
dipole: -1.7203 0.4235 0.8234
dipole: 1.9536
quadrupole: -84.8895 -70.5591 -84.2283
quadrupole: -5.8117 -0.0289 1.5698
quadrupole: -4.9972 9.3332 -4.3360 -5.8117 -0.0289 1.5698
hfenergy: -578.1895704 hartree
pointgroup: C01 [X(C10H22N2O1)]
dipole: -0.6897129 0.1220048 0.3165192 debye
polarizability: 146.1856711|0.006764|139.954206|-4.4729972|-1.8641692|101.1862896 unknown
InChI: InChI=1S/C10H22N2O/c1-4-6-8-12(9-7-5-2)10(11)13-3/h11H,4-9H2,1-3H3
charge 0 multiplicity 1
35 atoms
O  -1.372597 2.000843 0.373148
N  0.018335 0.215284 -0.065503
N  0.820574 2.342928 -0.701013
C  1.209627 -0.423248 -0.663025
C  -0.981084 -0.63556 0.611528
C  2.428955 -0.453207 0.287205
C  -2.097212 -1.14435 -0.331825
C  3.656311 -1.130651 -0.362685
C  -3.077544 -2.104514 0.379272
C  -0.111529 1.58689 -0.170912
C  4.886877 -1.154848 0.56967
C  -4.202974 -2.60313 -0.552723
C  -1.601175 3.446027 0.423003
H  1.479345 0.139368 -1.574494
H  0.929913 -1.454038 -0.958819
H  -1.43559 -0.071054 1.443651
H  -0.442486 -1.499566 1.049953
H  2.67664 0.590243 0.558646
H  2.161384 -0.985132 1.223611
H  -2.647737 -0.269956 -0.728389
H  -1.639023 -1.6593 -1.201059
H  3.395921 -2.168483 -0.65859
H  3.912298 -0.593312 -1.29837
H  -2.517053 -2.974243 0.780557
H  -3.523465 -1.590341 1.255413
H  4.668592 -1.711365 1.500765
H  5.755482 -1.636214 0.083317
H  5.183737 -0.128287 0.855033
H  -3.786373 -3.150328 -1.419381
H  -4.895922 -3.283514 -0.024248
H  -4.794161 -1.754874 -0.945858
H  0.587137 3.343504 -0.791716
H  -0.820439 3.959431 1.016854
H  -2.578878 3.560459 0.913934
H  -1.644489 3.884835 -0.593046
