program: Gaussian 09
title: 000236133
version: EM64L-G09RevD.01
frameworkgroup: C1[X(C13H19Cl2NO3)]
method: RPBEPBE
basis: SDD
operation: Freq
keyword: #p
keyword: freq=noraman
keyword: PBEPBE/SDD
title: #p freq=noraman PBEPBE/SDD
converged: YES YES NO NO
title: Mulliken charges:
elementType: Cl Cl O O O N C C C C C C C C C C C C C H H H H H H H H H H H H H H H H H H H
charge: -0.083558 -0.090925 -0.312369 -0.270445 -0.279960 -0.205085 0.216680 -0.389962 -0.361797 0.088457 0.227063 0.252078 -0.539113 -0.562816 -0.370755 -0.366904 -0.515037 -0.534721 -0.535252 0.229655 0.284864 0.244633 0.277939 0.271215 0.255809 0.258551 0.259761 0.238190 0.240467 0.227091 0.260631 0.210899 0.249833 0.221186 0.217070 0.219088 0.224499 0.243040
chargesum: 0.00000
title: Mulliken charges with hydrogens summed into heavy atoms:
elementType: Cl Cl O O O N C C C C C C C C C C C C C
charge: -0.083558 -0.090925 -0.312369 -0.270445 -0.279960 -0.205085 0.216680 0.124557 0.160776 0.088457 0.227063 0.252078 -0.012088 -0.044504 -0.132565 -0.126437 0.183584 0.153368 0.151375
polarizability: 2.38258624e+02 -2.34525855e+00 1.65181280e+02 1.06276781e+01 -2.41976338e+01 1.57353004e+02
1716.lowfreq: -9.6228 -7.1183 -0.0014 -0.0013 0.0016 5.4726 24.3562 29.7249 33.6232
frequency: 24.2255 29.6292 33.3983 44.6183 70.3273 73.0254 88.0723 93.6445 96.3850 106.9736 129.6502 145.8873 153.1439 179.9417 201.5215 205.9225 227.8445 233.2466 259.4575 269.4234 311.6335 321.8945 342.2912 351.6091 370.2325 387.0720 406.5977 472.0190 485.1078 507.3408 565.3842 593.7286 620.4245 633.0573 652.1304 665.2502 692.6204 765.0697 769.7615 772.3812 803.9300 853.8595 877.6957 899.6857 919.2772 966.6391 991.7338 1010.1122 1030.9214 1041.2810 1051.8388 1084.2660 1110.3233 1111.6839 1113.9681 1131.1896 1142.5453 1152.5004 1157.1820 1171.9711 1190.0762 1193.9161 1226.9281 1242.9910 1246.3934 1263.4389 1270.0914 1306.8415 1338.6432 1345.2188 1362.9349 1368.1137 1416.0166 1432.4367 1434.4686 1439.0849 1446.8528 1448.8610 1456.1835 1459.5132 1466.1476 1467.3224 1468.4712 1476.2939 1479.8825 1484.6056 1493.3264 1575.7685 1593.4834 2957.4661 2958.4793 2970.6227 2975.0542 3031.7873 3044.3227 3045.1453 3045.4514 3051.9724 3053.1399 3081.5252 3098.5624 3122.0789 3122.7507 3125.9977 3134.3972 3140.6055 3153.2321 3173.7257
redmass: 7.1199 8.6620 7.4502 6.4833 3.6592 3.2576 2.5832 2.2871 3.1488 3.4410 3.6168 4.9781 1.3268 3.3402 3.9880 4.7395 2.2975 1.2258 1.2394 5.2469 4.6720 3.5683 4.3416 3.6642 4.6229 4.4218 3.5843 5.6792 3.1511 3.6793 4.1563 5.0721 5.2070 3.8483 4.3111 5.4888 6.7640 4.2231 1.6391 1.2716 3.5081 4.0591 1.3634 2.3672 2.7788 8.8069 2.0376 2.5223 1.7381 4.6504 5.4346 2.6714 1.2347 1.2598 1.2570 1.4133 1.4418 1.3534 1.3885 1.6267 2.2188 1.3848 2.2836 1.4124 1.6133 1.9344 1.6045 1.3353 1.3961 1.5773 1.4544 7.1889 1.3698 1.2407 1.1050 1.1702 1.0944 1.4017 1.2424 1.4099 1.0622 1.0601 1.3810 1.1108 1.3009 1.0553 1.2603 7.0289 7.2086 1.0329 1.0331 1.0629 1.0341 1.0623 1.0657 1.1038 1.1038 1.0566 1.0875 1.0994 1.1044 1.0996 1.1041 1.0993 1.1103 1.1122 1.0866 1.0954
irintensity: 0.3705 0.5762 1.2212 0.6928 1.1908 8.0015 0.3839 5.6697 2.9529 0.8856 11.1939 0.3833 2.3571 0.8154 1.8010 9.5930 3.5586 1.2482 0.8904 1.2597 6.2361 3.4044 3.2898 8.6570 1.3977 7.8951 20.9286 1.3014 9.4498 9.7891 3.4877 23.9290 21.1673 2.5211 26.6601 67.2966 17.2241 5.7145 39.6742 20.9277 3.6294 1.6719 0.0072 22.3967 37.6885 21.3444 13.4704 17.4688 18.9224 6.3455 208.4664 191.0844 7.5144 0.0291 0.5721 32.8204 1.2293 3.3061 10.2791 14.9004 39.1025 28.4654 168.7961 12.5177 40.8360 12.8573 11.8660 28.2975 5.8699 4.6810 7.5941 12.2698 27.4395 59.3866 15.2781 8.3308 2.3622 58.6443 26.9121 85.1451 17.8696 20.5197 139.9901 27.8279 8.6831 14.3289 63.9731 1.2444 43.9450 52.7480 97.7603 47.9900 64.5496 11.6293 16.0770 32.0514 61.0522 23.1955 25.2680 36.3915 1.0336 22.0180 17.5850 15.8935 18.3024 20.0323 7.2997 10.4543
temp: 298.150 k
press: 1.00000 atm
elementType: 17 17 8 8 8 7 6 6 6 6 6 6 6 6 6 6 6 6 6 1 1 1 1 1 1 1 1 1 1 1 1 1 1 1 1 1 1 1
symmnumber: 1
zpe: 793454.1 jmol-1
zpe.correction: 0.302211 hartree
zpe.thermalcorrener: 0.324136 hartree
zpe.thermalcorrenthalpy: 0.325080 hartree
zpe.thermalcorrgfe: 0.248727 hartree
zpe.sumelectzpe: -1705.779667 hartree
zpe.sumelectthermal: -1705.757742 hartree
zpe.sumelectthermalent: -1705.756798 hartree
zpe.sumelectthermalfe: -1705.833151 hartree
dipole: -6.2056 -1.0027 0.7335
dipole: 6.3287
quadrupole: -123.9163 -125.0015 -120.8975
quadrupole: -2.4828 -6.2798 -14.4025
quadrupole: -0.6446 -1.7297 2.3743 -2.4828 -6.2798 -14.4025
hfenergy: -1706.0818782 hartree
pointgroup: C01 [X(C13H19Cl2N1O3)]
dipole: -2.4022798 -0.6546981 0.0112198 debye
polarizability: 238.5823477|-3.1317087|183.1015829|10.9152158|-9.027976|139.108978 unknown
InChI: InChI=1S/C13H19Cl2NO3/c1-17-10-4-5-11(18-2)13(19-3)12(10)16(8-6-14)9-7-15/h4-5H,6-9H2,1-3H3
charge 0 multiplicity 1
38 atoms
Cl 3.45748 -0.750319 -2.685717
Cl 3.597151 1.955596 2.660731
O  -1.178413 1.809276 -0.841105
O  1.287657 -2.130713 0.469366
O  -3.610425 0.544231 -0.373016
N  1.268763 0.495876 -0.456031
C  0.049017 -0.161766 -0.144527
C  1.464999 1.0803 -1.791456
C  2.368793 0.564811 0.522913
C  -1.205598 0.492751 -0.33477
C  0.028742 -1.515876 0.342539
C  -2.437768 -0.185601 -0.087238
C  1.749632 0.054151 -2.894676
C  2.197087 1.834312 1.375844
C  -1.189345 -2.155541 0.644597
C  -2.421725 -1.498653 0.422594
C  -1.82113 2.849773 -0.009463
C  1.319335 -3.535035 0.878794
C  -4.887036 -0.139633 -0.160617
H  2.293625 1.810195 -1.74737
H  0.554457 1.639441 -2.08723
H  3.337559 0.585436 -0.005062
H  2.368952 -0.330493 1.163925
H  1.033892 -0.781437 -2.878604
H  1.778926 0.527158 -3.889671
H  2.267227 2.758367 0.78169
H  1.265133 1.81554 1.96097
H  -1.199236 -3.181749 1.021886
H  -3.353503 -2.029398 0.635479
H  -1.637972 3.795487 -0.542503
H  -2.903201 2.659793 0.081105
H  -1.351514 2.884417 0.992462
H  2.384005 -3.810277 0.866873
H  0.760485 -4.172579 0.166251
H  0.909596 -3.67006 1.899173
H  -5.030708 -0.409718 0.904138
H  -4.962496 -1.049523 -0.787245
H  -5.655843 0.585464 -0.466128
