program: Gaussian 09
title: 000236132
version: EM64L-G09RevD.01
frameworkgroup: C1[X(C10H11Cl4N)]
method: RPBEPBE
basis: SDD
operation: Freq
keyword: #p
keyword: freq=noraman
keyword: PBEPBE/SDD
title: #p freq=noraman PBEPBE/SDD
converged: YES YES NO NO
title: Mulliken charges:
elementType: Cl Cl Cl Cl N C C C C C C C C C C H H H H H H H H H H H
charge: -0.046902 -0.046877 -0.053030 -0.053024 -0.181730 -0.389223 -0.389280 0.512164 -0.585126 -0.585116 -0.317582 -0.317639 -0.098087 -0.098145 -0.309296 0.253182 0.252869 0.253179 0.252876 0.270026 0.294397 0.270022 0.294394 0.266085 0.266075 0.285785
chargesum: 0.00000
title: Mulliken charges with hydrogens summed into heavy atoms:
elementType: Cl Cl Cl Cl N C C C C C C C C C C
charge: -0.046902 -0.046877 -0.053030 -0.053024 -0.181730 0.116829 0.116775 0.512164 -0.020703 -0.020700 -0.051497 -0.051563 -0.098087 -0.098145 -0.023511
polarizability: 1.99456591e+02 3.28976065e-03 1.97640118e+02 3.64905250e-03 -1.78457324e+01 8.12580375e+01
1716.lowfreq: -3.0961 -3.0207 -0.0031 -0.0028 -0.0022 1.3686 24.3737 34.0472 38.4287
frequency: 24.3396 34.0402 38.4153 47.6078 107.8316 124.5598 141.0070 165.1993 166.9065 197.3256 202.8478 214.9257 230.4893 242.8418 337.3252 348.1271 412.4288 412.9429 423.1145 512.2208 551.3980 553.7820 569.0780 664.9479 680.3660 705.6109 754.1475 786.3036 789.2590 816.9585 824.1409 833.2411 834.0103 965.4136 971.1893 999.2986 1033.8839 1035.9464 1047.2588 1098.5460 1118.9652 1122.3504 1189.3749 1217.9476 1256.4656 1257.0013 1272.7066 1279.0991 1294.1383 1354.5877 1354.8949 1371.3171 1374.1367 1433.9858 1462.3108 1462.5761 1469.5028 1486.6666 1507.7632 1551.4735 1611.1854 3017.7294 3022.5427 3063.8891 3064.0540 3073.3202 3078.8181 3147.8407 3148.2548 3184.9552 3187.1960 3198.8487
redmass: 18.3022 20.2565 15.1193 8.6399 2.6712 2.5339 8.5278 15.1864 6.5435 4.5644 4.4579 8.5467 5.3822 3.7866 4.2063 6.6507 3.8869 9.4882 5.8215 5.1644 3.4791 4.5975 4.9835 2.1879 6.4901 5.3485 9.0868 1.1479 1.1442 5.5606 1.3976 1.3858 1.7664 5.7342 2.4998 1.4250 4.5877 3.1612 1.7318 1.5690 1.9961 1.3976 1.7039 2.2243 1.1649 1.1625 1.2224 1.3475 1.2293 1.5679 1.2487 6.7962 1.5165 3.2036 1.0931 1.1049 3.2194 1.0935 1.1352 7.0658 7.3384 1.0602 1.0610 1.0570 1.0582 1.1029 1.1037 1.1117 1.1115 1.0911 1.0917 1.0945
irintensity: 0.0499 1.0963 0.8736 1.5343 1.2711 2.2944 0.9136 0.1665 0.9279 1.1216 0.5741 1.8642 0.1381 12.4435 13.2437 4.6674 1.2449 6.7801 3.2837 0.0269 3.2341 19.4898 6.7036 22.8649 45.8239 62.8624 93.8540 0.3503 20.5742 21.1131 20.3257 0.6847 60.6421 28.2530 67.5760 3.0622 1.4630 0.5241 24.4771 25.9040 21.4875 33.8152 9.4105 29.0591 16.0664 11.9585 6.0335 12.7104 13.2186 39.6684 0.7976 13.9211 0.0005 4.4500 0.8317 19.5950 161.5869 27.3687 24.2833 174.8457 461.4354 22.0802 10.4575 3.4657 25.6010 9.6893 8.5718 4.8708 17.3903 0.8968 4.1439 4.9926
temp: 298.150 k
press: 1.00000 atm
elementType: 17 17 17 17 7 6 6 6 6 6 6 6 6 6 6 1 1 1 1 1 1 1 1 1 1 1
symmnumber: 1
zpe: 499651.3 jmol-1
zpe.correction: 0.190307 hartree
zpe.thermalcorrener: 0.206313 hartree
zpe.thermalcorrenthalpy: 0.207258 hartree
zpe.thermalcorrgfe: 0.143325 hartree
zpe.sumelectzpe: -2281.523411 hartree
zpe.sumelectthermal: -2281.507405 hartree
zpe.sumelectthermalent: -2281.506460 hartree
zpe.sumelectthermalfe: -2281.570393 hartree
dipole: -1.6189 0.0007 -0.0005
dipole: 1.6189
quadrupole: -126.1037 -136.3775 -116.3323
quadrupole: -0.0026 0.0024 0.0160
quadrupole: 0.1674 -10.1064 9.9389 -0.0026 0.0024 0.0160
hfenergy: -2281.7137179 hartree
pointgroup: C01 [X(C10H11Cl4N1)]
dipole: -0.6369198 0.001155 -0.0006497 debye
dipolederiv: -0.3620526 -0.2570053 -0.0007806 -0.3327459 -0.5771729 -0.018438 0.0529251 0.0627616 -0.1895166 -0.3602176 0.2562717 0.000541 0.332134 -0.5789083 -0.0180364 -0.0528263 0.0631133 -0.1895585 -0.3376426 -0.2645545 0.0710601 -0.3363181 -0.6090421 0.1459988 0.0872054 0.1427998 -0.1042277 -0.3355148 0.2634512 -0.070997 0.3352209 -0.6108684 0.1467801 -0.0871844 0.1435442 -0.1044957 -1.7493337 0.0014032 -0.0012812 0.0011392 -0.8837825 -0.0968066 -0.0019727 -0.1979496 -0.3344339 0.2868087 0.209401 0.007427 0.4144478 0.4980337 -0.0012985 0.0195652 0.1309641 0.1820994 0.2849738 -0.209045 -0.0072714 -0.4137528 0.4998729 -0.0017809 -0.0188305 0.1307715 0.1821478 1.969512 -0.0027869 0.0015404 -0.0027703 0.0930831 -0.0017251 0.0018105 0.0158751 0.1340733 0.3800904 0.3122413 -0.0321142 0.3449621 0.6271432 -0.0609223 -0.0684692 -0.1722976 0.1220826 0.377915 -0.3111377 0.0321796 -0.3439741 0.6289677 -0.0613867 0.0681052 -0.1726972 0.1221055 -0.7089413 0.0534549 0.003303 0.5034127 -0.2568717 0.0327932 -0.1428838 0.0150506 -0.2032295 -0.710878 -0.0521262 -0.0040103 -0.5020433 -0.2552092 0.0319716 0.1420842 0.0144764 -0.2029946 0.8542261 0.1797756 -0.0435141 0.4427199 1.0202172 -0.2944025 -0.1089243 -0.2723241 0.0443939 0.8520522 -0.1787527 0.0439848 -0.4416861 1.0221142 -0.2952884 0.1095303 -0.2729983 0.0446625 -0.4599052 -0.000536 0.0000338 -0.000539 -0.7165198 0.1660632 0.0000004 0.1565085 -0.1776489 0.0652581 0.0443569 -0.0957669 -0.028881 -0.0260883 0.0601824 -0.0597406 0.0328535 -0.0268125 -0.1032684 0.0255488 0.0708848 0.0199761 0.0403884 -0.0471266 0.0280633 -0.0473741 0.0645115 0.0650107 -0.0447363 0.0960677 0.0284198 -0.0260775 0.0599792 0.0600438 0.0325921 -0.0265163 -0.1032482 -0.0249764 -0.0713089 -0.0194583 0.0405434 -0.0469697 -0.0284448 -0.0473829 0.0643288 0.0091031 -0.0282666 -0.0559872 0.0066447 -0.0263949 0.1021672 -0.0460762 0.0555364 -0.0155814 -0.0490288 0.0234587 0.0881247 -0.0014476 0.0031504 0.0059662 0.0639507 0.0150247 0.0668513 0.0090234 0.0280377 0.0563313 -0.0069088 -0.0265143 0.1019886 0.0462852 0.0554638 -0.015389 -0.0488646 -0.0233051 -0.0882757 0.0016278 0.0032216 0.006199 -0.0640518 0.015153 0.0666187 0.0724103 -0.0624101 0.0148656 -0.0826489 0.0035827 0.031921 0.0236867 0.039779 0.1558817 0.0729084 0.0621349 -0.0149284 0.0823709 0.0031466 0.0321009 -0.0237412 0.039973 0.1558263 0.0296038 0.0001032 -0.0001078 0.0000984 0.1099848 0.0200703 -0.00011 0.0207831 0.1848213 unknown
polarizability: 199.4565692|0.0146788|196.6356232|0.0601967|-20.841426|82.2625536 unknown
InChI: InChI=1S/C10H11Cl4N/c11-1-3-15(4-2-12)10-6-8(13)5-9(14)7-10/h5-7H,1-4H2
charge 0 multiplicity 1
26 atoms
Cl -3.174065 -3.658669 -0.276467
Cl -3.16364 3.667857 0.272074
Cl 3.209824 2.678664 -0.715894
Cl 3.200325 -2.688472 0.720625
N  -1.239234 0.0018 -0.00167
C  -2.009683 -1.196533 0.377921
C  -2.005545 1.202624 -0.381641
C  0.169118 -0.00026 -0.000329
C  -2.184345 -2.1472 -0.822842
C  -2.17915 2.153296 0.819279
C  0.902497 -1.187253 0.314891
C  0.90666 1.184498 -0.314243
C  2.308977 1.14577 -0.308274
C  2.304927 -1.152829 0.311398
C  3.058431 -0.004675 0.002225
H  -1.526307 -1.728589 1.216154
H  -3.006171 -0.8853 0.737564
H  -1.519367 1.733648 -1.218899
H  -3.002402 0.894545 -0.742986
H  -2.761965 -1.685549 -1.637502
H  -1.226595 -2.531589 -1.201611
H  -2.7593 1.69305 1.632939
H  -1.220806 2.534707 1.199556
H  0.40095 -2.126034 0.556236
H  0.408419 2.124812 -0.556501
H  4.149246 -0.006318 0.003197
