program: Gaussian 09
title: 000236130
version: EM64L-G09RevD.01
frameworkgroup: C1[X(C13H15N3O4S)]
method: RPBEPBE
basis: SDD
operation: Freq
keyword: #p
keyword: freq=noraman
keyword: PBEPBE/SDD
title: #p freq=noraman PBEPBE/SDD
converged: NO YES NO NO
title: Mulliken charges:
elementType: S O O O O N N N C C C C C C C C C C C C C H H H H H H H H H H H H H H H
charge: 0.903174 -0.513417 -0.524226 -0.236035 -0.235516 -0.356369 -0.398672 -0.342453 -0.370398 -0.085530 0.250992 -0.678338 -0.241338 -0.250103 0.194710 -0.200222 0.439592 -0.379658 -0.359837 0.152820 -0.797429 0.230006 0.245008 0.247567 0.283698 0.208029 0.296499 0.286883 0.304957 0.248746 0.246714 0.367545 0.354336 0.229475 0.229537 0.249254
chargesum: 0.00000
title: Mulliken charges with hydrogens summed into heavy atoms:
elementType: S O O O O N N N C C C C C C C C C C C C C
charge: 0.903174 -0.513417 -0.524226 -0.236035 -0.235516 -0.356369 -0.031127 0.011883 0.104616 -0.085530 0.250992 0.060955 0.055161 0.036781 0.194710 0.104735 0.439592 -0.130913 -0.113123 0.152820 -0.089163
polarizability: 2.48783999e+02 1.60697801e+01 2.47485621e+02 -1.16127398e+01 9.06551218e+00 1.47257541e+02
1716.lowfreq: -15.2541 -4.6038 -0.0011 0.0012 0.0014 6.0052 19.0967 35.1062 35.7809
frequency: 18.5302 35.0504 35.6256 38.2570 46.9705 60.8201 86.4554 116.9223 123.6172 145.9421 154.0440 161.8080 165.4569 184.8727 211.4852 224.5349 229.4597 281.5826 295.8547 304.0844 363.2271 372.3888 384.4252 401.1885 408.8354 423.6891 457.7323 470.2343 496.4210 513.3818 524.6423 585.8684 605.4332 621.3127 646.5318 678.5622 699.9847 709.5542 736.4982 750.8988 776.1534 782.7621 796.4969 802.9187 828.3394 856.1708 888.0774 908.3909 928.3740 940.3586 963.8324 984.8376 989.8549 995.1821 1030.0403 1048.5887 1051.7858 1085.5593 1102.1195 1117.0254 1146.2692 1172.3919 1183.4749 1216.0870 1253.4445 1286.8546 1295.8577 1303.6500 1344.8241 1357.4219 1371.7946 1378.2863 1389.3157 1391.2093 1400.9761 1443.1895 1445.1901 1471.3729 1473.0577 1474.0908 1478.2729 1482.7366 1580.4908 1592.1981 1593.1367 1633.5808 1682.5942 2981.8528 2994.7548 2999.3685 3060.5257 3063.8210 3085.3738 3092.1950 3135.1497 3136.5949 3138.3898 3158.6418 3164.2003 3194.2813 3516.9386 3558.4904
redmass: 6.4051 1.2170 6.4018 3.1844 4.3446 5.0935 1.8388 5.2151 5.3254 6.3526 4.8363 7.1548 6.1664 3.7210 5.1546 1.8374 6.7816 4.4511 3.7252 4.6788 9.9884 4.0489 7.0556 4.8647 2.9055 6.5755 4.7994 4.9699 4.5337 3.5306 7.7144 6.0102 4.9865 6.9523 1.3413 4.7327 2.1328 3.3765 4.5515 3.0400 5.0231 2.0349 2.4153 3.5199 1.3608 1.2439 2.8872 1.4871 9.8403 3.5606 1.3055 1.4054 1.4462 4.4448 4.7854 1.6005 2.4803 1.7847 2.2137 1.2930 2.9864 2.0124 1.1439 3.0662 1.6208 2.0739 1.2694 1.8067 1.4572 2.8960 1.6754 5.5707 3.0615 1.1973 1.2218 1.7815 1.2331 1.0879 2.2534 1.0876 1.0423 1.0509 5.2425 6.8622 5.9421 7.5019 5.5287 1.0387 1.0425 1.0555 1.1035 1.0952 1.0965 1.1001 1.0891 1.0893 1.1001 1.0958 1.0965 1.0946 1.0771 1.0787
irintensity: 0.7710 0.0402 0.0512 3.3339 0.4227 0.5973 1.3786 1.2770 4.0255 10.5305 2.5768 3.9169 7.6726 1.4781 8.9851 0.3230 7.1209 3.4307 4.4455 3.2262 27.2900 6.1038 17.0520 7.0203 0.6262 34.1490 14.0688 29.7028 37.7537 80.4303 4.4251 33.7485 21.0743 0.3579 69.2886 10.7675 1.9183 0.4420 20.5910 30.2153 5.7609 99.4702 93.5939 43.1244 29.5934 0.9209 6.7472 7.2271 63.6993 10.6909 0.5706 0.5603 0.9295 1.6295 12.0515 28.8183 22.3619 13.4188 4.2155 8.3276 25.2161 49.7367 13.7393 7.4160 25.1343 45.0691 2.6539 60.7122 42.7130 92.8537 32.8152 0.1171 10.6851 49.1618 17.6138 33.3394 4.6698 16.4585 19.3194 14.7294 12.4745 9.9583 22.4255 0.7674 11.7948 332.5271 788.3398 22.0712 30.9299 21.5261 20.2782 15.3744 21.1275 14.3090 13.3420 5.7034 2.9542 4.4429 7.1746 2.0453 66.4581 87.1620
temp: 298.150 k
press: 1.00000 atm
elementType: 16 8 8 8 8 7 7 7 6 6 6 6 6 6 6 6 6 6 6 6 6 1 1 1 1 1 1 1 1 1 1 1 1 1 1 1
symmnumber: 1
zpe: 704429.4 jmol-1
zpe.correction: 0.268303 hartree
zpe.thermalcorrener: 0.289840 hartree
zpe.thermalcorrenthalpy: 0.290784 hartree
zpe.thermalcorrgfe: 0.215503 hartree
zpe.sumelectzpe: -1365.907743 hartree
zpe.sumelectthermal: -1365.886206 hartree
zpe.sumelectthermalent: -1365.885262 hartree
zpe.sumelectthermalfe: -1365.960542 hartree
dipole: 5.5624 4.1413 -4.2251
dipole: 8.1205
quadrupole: -116.1157 -152.9822 -130.5644
quadrupole: 10.7116 1.2034 4.3552
quadrupole: 17.1051 -19.7614 2.6564 10.7116 1.2034 4.3552
hfenergy: -1366.1760457 hartree
pointgroup: C01 [X(C13H15N3O4S1)]
dipole: 1.7956737 -2.3736781 1.1611399 debye
polarizability: 241.6794012|-13.475423|252.4736478|1.6946255|21.731654|149.3741114 unknown
InChI: InChI=1S/C13H15N3O4S/c1-3-16(11-8-14-13(18)15-12(11)17)21(19,20)10-6-4-9(2)5-7-10/h4-8,14-15H,3H2,1-2H3
charge 0 multiplicity 1
36 atoms
S  0.717595 1.844562 -0.028028
O  0.021329 1.910718 -1.507282
O  1.487034 3.131778 0.612586
O  -3.427218 0.982649 0.423929
O  -2.871809 -3.624986 -0.133378
N  -0.527167 1.195037 1.439942
N  -3.089214 -1.298311 0.167102
N  -1.105379 -2.378141 0.776757
C  -1.20037 2.389556 2.057846
C  1.942402 0.409546 -0.095478
C  -1.238979 0.040922 1.053277
C  -1.772298 3.486855 1.133092
C  1.859126 -0.479422 -1.178306
C  2.931079 0.322241 0.898999
C  -2.635757 0.008972 0.535849
C  -0.567222 -1.173095 1.183366
C  3.825384 -1.661898 -0.268115
C  2.810853 -1.521931 -1.252126
C  3.871215 -0.727306 0.803013
C  -2.403433 -2.516794 0.23273
C  4.86846 -2.758481 -0.379033
H  -2.014191 1.969984 2.680066
H  -0.44846 2.835799 2.732743
H  -0.969408 3.992683 0.570563
H  -2.515729 3.073529 0.437011
H  -2.265209 4.249663 1.764769
H  1.088727 -0.340256 -1.944164
H  2.974874 1.061471 1.705029
H  0.434801 -1.196463 1.616181
H  2.769711 -2.227496 -2.08985
H  4.656426 -0.815607 1.562813
H  -4.042875 -1.342195 -0.208208
H  -0.576722 -3.248005 0.86789
H  4.494947 -3.620501 -0.957895
H  5.18682 -3.121044 0.613996
H  5.773658 -2.384032 -0.894886
