program: Gaussian 09
title: 000236124
version: EM64L-G09RevD.01
frameworkgroup: C1[X(C10H12O4)]
method: RPBEPBE
basis: SDD
operation: Freq
keyword: #pfreq=noraman
keyword: PBEPBE/SDD
title: #p freq=noraman PBEPBE/SDD
converged: YES YES NO NO
title: Mulliken charges:
elementType: O O O O C C C C C C C C C C H H H H H H H H H H H H
charge: -0.277657 -0.258954 -0.417731 -0.199561 0.364621 0.424930 -0.501733 -0.394015 -0.404654 -0.240880 -0.181497 -0.685528 -0.396167 0.193692 0.254907 0.246695 0.252605 0.207212 0.209839 0.224237 0.278161 0.247099 0.207036 0.232284 0.230909 0.384150
chargesum: 0.00000
title: Mulliken charges with hydrogens summed into heavy atoms:
elementType: O O O O C C C C C C C C C C
charge: -0.277657 -0.258954 -0.033580 -0.199561 0.364621 0.424930 -0.246826 -0.147319 -0.152049 0.176171 0.042740 -0.015300 0.129094 0.193692
polarizability: 1.53624766e+02 -2.41543644e+00 1.33782168e+02 1.01773609e+01 8.12488135e+00 7.93051188e+01
1716.lowfreq: -2.5962 -0.0006 -0.0005 -0.0005 2.5916 7.9828 30.8029 40.8183 50.1130
frequency: 30.7667 40.8123 50.1120 71.8496 112.7025 127.1937 186.7491 228.4016 235.9794 251.4754 279.7974 322.9422 333.6279 413.6007 451.1070 480.8985 499.5602 536.6066 592.5911 601.8798 625.4301 630.8387 682.2751 716.7034 766.6223 823.2020 827.8720 834.5451 849.3612 859.2147 948.9501 958.7801 979.0656 1000.0353 1023.1047 1042.1415 1058.7175 1087.1701 1116.6853 1136.7658 1145.8021 1178.9013 1231.9327 1243.3454 1262.4131 1265.8951 1292.1258 1356.4849 1366.0700 1395.1582 1400.4573 1437.6209 1451.4144 1461.3237 1474.3954 1480.2568 1492.6410 1597.5733 1613.7082 1693.6608 2955.7993 2996.6755 2998.8256 3013.5801 3078.4540 3093.8495 3105.6818 3138.5687 3168.6144 3171.6325 3181.8506 3518.7220
redmass: 7.6119 5.1065 6.1152 5.1699 1.7680 3.4574 4.2474 2.8940 2.8965 1.5726 7.5125 3.5709 4.8473 4.2385 2.9620 2.2961 3.4032 4.6159 5.6041 4.6488 5.5074 1.4459 1.9293 6.1485 1.4010 4.0595 1.1257 3.8273 1.7286 1.4039 2.9425 1.3097 5.9124 3.1698 2.4532 2.9533 2.6166 1.5399 2.1844 1.4354 1.9512 1.1847 1.3179 2.4186 1.1428 2.1134 1.3338 1.5076 1.3545 2.3355 1.9645 1.7060 1.5023 1.0400 1.9472 1.1621 1.1425 7.0598 6.6147 9.0407 1.0554 1.0362 1.0627 1.1075 1.0982 1.0988 1.1014 1.0877 1.0912 1.0919 1.0976 1.0643
irintensity: 0.7074 0.9213 3.9535 1.1875 1.3347 1.3477 0.1264 0.4377 2.3943 0.7375 1.2249 3.6947 2.0520 11.1206 4.0023 24.4671 32.9870 3.3460 15.2658 1.3123 10.3909 142.5041 24.5130 1.2553 55.5720 4.0675 1.4532 3.8890 46.7186 2.2001 64.0719 0.8974 5.4527 211.3618 151.4354 105.3754 28.4701 9.5431 11.1992 4.4461 253.2419 16.5534 44.5408 89.6135 0.0508 14.9872 8.8302 23.6994 10.6136 1.0687 54.0971 14.0192 44.6561 11.9721 136.0952 4.5416 5.5737 86.6796 203.9155 196.0539 40.5816 24.6758 26.4350 36.0526 7.1913 29.6910 35.4195 14.3397 7.4404 11.4599 4.9497 27.3933
temp: 298.150 k
press: 1.00000 atm
elementType: 8 8 8 8 6 6 6 6 6 6 6 6 6 6 1 1 1 1 1 1 1 1 1 1 1 1
symmnumber: 1
zpe: 532814.1 jmol-1
zpe.correction: 0.202938 hartree
zpe.thermalcorrener: 0.216827 hartree
zpe.thermalcorrenthalpy: 0.217771 hartree
zpe.thermalcorrgfe: 0.160556 hartree
zpe.sumelectzpe: -688.084983 hartree
zpe.sumelectthermal: -688.071094 hartree
zpe.sumelectthermalent: -688.070150 hartree
zpe.sumelectthermalfe: -688.127366 hartree
dipole: 1.5394 -1.5383 -1.0383
dipole: 2.4112
quadrupole: -63.8334 -75.0618 -87.5556
quadrupole: 6.3226 5.0883 -0.9987
quadrupole: 11.6502 0.4218 -12.0720 6.3226 5.0883 -0.9987
hfenergy: -688.2879212 hartree
pointgroup: C01 [X(C10H12O4)]
dipole: -0.6016269 0.6537768 -0.3324669 debye
dipolederiv: -1.3057179 0.6731944 0.0957828 0.8499808 -0.9329889 -0.0739043 0.0996654 -0.0577064 -0.2913065 -1.5352809 -0.4466876 0.0946217 -0.4293536 -0.4783737 -0.011004 0.2187202 0.0606334 -0.3096695 -0.6273161 -0.3081928 0.0778884 -0.488438 -1.1573109 0.2035738 -0.0152952 0.0891732 -0.2827751 -0.4127886 -0.1591291 0.0070343 -0.2063029 -0.5776232 0.0080513 0.0407865 0.242198 -0.8530929 0.8589758 -0.4190514 -0.0624471 -0.9204989 0.9973599 0.0627815 -0.0565878 0.0028651 0.11399 1.5449456 0.3247275 -0.119531 0.1619999 0.343508 -0.0260797 -0.1827797 -0.0449206 0.1480494 -0.6402647 0.1648345 0.0312368 0.252305 -0.1603217 -0.0089808 0.0536102 -0.0114925 -0.2250251 -0.1753491 -0.0728562 -0.0183654 0.3563132 -0.4635175 -0.0330664 -0.0328892 0.0248276 -0.2437588 -0.4405455 -0.1061232 0.0150776 -0.2727503 -0.1768252 0.0209486 0.0535778 -0.0012051 -0.2203395 1.0308156 -0.3850885 -0.0603719 -0.0592628 0.2820147 0.0179 -0.093096 0.0675173 0.4022449 0.3563136 -0.0195407 -0.0557387 -0.1078473 0.1875436 -0.01002 -0.0659722 -0.0180852 -0.1120194 -0.0272802 0.1095059 0.0036521 0.0833481 -0.0724471 -0.0078145 0.0080717 -0.0119596 0.0554891 0.5564109 0.201333 0.0754438 0.524775 0.4877947 -0.0787007 -0.0925822 -0.142392 0.0309 0.4869892 0.4910931 -0.0957685 0.6257215 1.3286717 -0.112222 0.0118479 -0.1950072 1.0738261 0.0947468 -0.0570419 0.021329 -0.0858131 -0.0385546 0.0115288 0.0222564 0.0196246 0.1684922 -0.1029982 -0.0113939 0.0384389 -0.020104 0.1072971 0.0068497 0.0410825 0.0070962 0.1722926 0.033352 0.08921 0.0169637 0.0799777 0.0113534 -0.0003918 0.0192326 0.0017213 0.1786121 -0.0928017 0.0304689 -0.0291677 -0.1058008 -0.0285272 -0.1015853 -0.0662763 -0.1053988 -0.0633561 -0.0598533 0.0639716 0.0127635 -0.0618657 -0.0031923 0.1159262 0.0697495 0.0797262 -0.1144362 0.0525047 -0.0764603 0.0159883 -0.0611755 -0.1023742 0.0222537 0.0176254 0.0261463 0.1470322 -0.0775527 -0.0364429 0.0483663 -0.024244 0.0756699 -0.0324297 0.028113 -0.0124174 0.1030434 0.070141 0.056938 -0.1109505 -0.0627179 -0.0516516 0.0679053 -0.048509 0.0413603 0.0291256 -0.1783694 0.0308914 0.0442979 -0.0048028 0.0649297 0.0046863 0.0475433 -0.0017767 0.1064292 0.0812057 -0.0846447 -0.0879993 -0.0169252 0.0063815 -0.0807729 -0.0670637 -0.0956847 -0.0276503 0.1171338 -0.042654 0.0452904 0.0144686 0.0265402 0.0733901 0.0148878 0.1086374 -0.0873201 0.3925835 -0.0108612 -0.0038356 -0.020987 0.3246437 -0.0388233 -0.025719 -0.0734809 0.1012226 unknown
polarizability: 153.9499903|-0.9638492|134.9595793|-9.1663488|-0.5369753|77.8024837 unknown
InChI: InChI=1S/C10H12O4/c1-2-13-8-4-3-5-9(6-8)14-7-10(11)12/h3-6,11H,2,7H2,1H3
charge 0 multiplicity 1
26 atoms
O  -2.36865 1.019207 -0.063953
O  2.028284 -1.004363 -0.582452
O  3.319159 2.351493 0.216044
O  2.615634 0.686064 1.688905
C  -1.608223 -0.160667 -0.101789
C  0.634067 -1.07733 -0.359921
C  -0.219491 0.041746 -0.308982
C  -2.138488 -1.463893 0.051963
C  0.127751 -2.39234 -0.208111
C  -3.819565 0.894155 0.178109
C  -1.251726 -2.567089 -0.002583
C  -4.389122 2.310121 0.188316
C  2.627439 0.297899 -0.778764
C  2.819937 1.075341 0.52693
H  0.13335 1.07233 -0.403121
H  -3.206211 -1.631612 0.213694
H  0.819689 -3.23743 -0.249766
H  -4.276673 0.281759 -0.626391
H  -3.987518 0.384555 1.14921
H  -1.651347 -3.579979 0.118278
H  3.624858 0.102742 -1.208733
H  2.064023 0.923871 -1.497711
H  -5.479148 2.279449 0.368568
H  -3.919269 2.912612 0.984217
H  -4.20814 2.810281 -0.778414
H  3.48748 2.858678 1.055858
