program: Gaussian 09
title: 000236115
version: EM64L-G09RevD.01
frameworkgroup: C1[X(C6H13NO)]
method: RPBEPBE
basis: SDD
operation: Freq
keyword: #p
keyword: freq=noraman
keyword: PBEPBE/SDD
title: #p freq=noraman PBEPBE/SDD
converged: YES YES NO NO
title: Mulliken charges:
elementType: O N C C C C C C H H H H H H H H H H H H H
charge: -0.462227 -0.111449 -0.403377 -0.421645 -0.438967 -0.028168 -0.362379 -0.718903 0.216595 0.236270 0.238302 0.216696 0.245050 0.186948 0.197516 0.222198 0.200584 0.229822 0.216383 0.202376 0.338375
chargesum: 0.00000
title: Mulliken charges with hydrogens summed into heavy atoms:
elementType: O N C C C C C C
charge: -0.123852 -0.111449 0.049487 0.033353 -0.006969 0.169348 0.060404 -0.070322
polarizability: 8.92208459e+01 5.78969137e-01 7.28109062e+01 -2.96947157e-01 -3.44396635e-01 6.03107420e+01
1716.lowfreq: -0.0005 0.0007 0.0008 7.1604 9.5177 26.1468 64.5068 79.9732 103.4357
frequency: 64.4856 79.8464 103.3281 164.2965 222.1888 234.5319 266.4101 320.5409 336.8930 402.3043 450.8539 514.8291 724.7577 762.0687 794.1592 819.2726 830.1674 939.5544 960.6763 975.3803 995.4020 1027.6339 1064.2691 1077.1129 1086.7007 1090.1368 1110.0240 1137.6810 1155.9512 1206.8448 1238.9218 1263.4089 1270.8169 1308.2317 1321.1889 1358.5326 1388.0218 1391.8255 1452.2075 1454.4517 1463.9668 1476.7229 1477.7456 1490.3393 2899.2311 2955.0716 2968.1040 2984.5707 3039.2798 3049.8815 3052.8007 3062.0917 3066.2538 3073.9394 3160.5200 3178.2560 3573.2860
redmass: 2.4108 2.2997 2.9398 2.6903 1.3616 2.1158 1.1105 3.0653 3.4620 2.4262 2.6001 2.6186 2.8703 1.6429 2.0838 1.5883 2.0864 2.4396 1.2136 1.6261 1.4016 2.4321 1.3041 1.2971 1.9154 1.9110 1.7223 1.5382 1.8937 1.2865 1.2864 2.4888 1.4305 1.3013 1.1873 1.3826 1.2439 1.7135 1.0846 1.0833 1.0945 1.1461 1.0635 1.0462 1.0689 1.0830 1.0367 1.0615 1.0985 1.0863 1.0548 1.0621 1.1009 1.0979 1.1150 1.1157 1.0659
irintensity: 4.6135 0.8533 0.5189 7.0540 4.3130 19.0065 135.6001 4.5921 2.3782 4.9421 8.5959 4.1500 11.5137 0.7756 0.3197 14.9123 2.2523 68.8860 10.9687 37.1216 17.2943 6.0924 7.9179 13.3010 10.6776 17.9802 1.5234 2.8228 1.9388 29.0953 12.0698 21.0060 2.7294 5.9405 6.3286 3.3505 16.5071 8.2372 6.6253 4.2381 2.4560 11.5075 8.3871 13.0680 49.3362 47.4674 38.5991 32.7770 0.1861 10.8203 51.1896 27.7307 76.5083 40.1347 1.6283 43.0044 2.4918
temp: 298.150 k
press: 1.00000 atm
elementType: 8 7 6 6 6 6 6 6 1 1 1 1 1 1 1 1 1 1 1 1 1
symmnumber: 1
zpe: 480527.8 jmol-1
zpe.correction: 0.183023 hartree
zpe.thermalcorrener: 0.192761 hartree
zpe.thermalcorrenthalpy: 0.193706 hartree
zpe.thermalcorrgfe: 0.148194 hartree
zpe.sumelectzpe: -365.672958 hartree
zpe.sumelectthermal: -365.663220 hartree
zpe.sumelectthermalent: -365.662275 hartree
zpe.sumelectthermalfe: -365.707787 hartree
dipole: -0.2309 -1.3497 0.4954
dipole: 1.4562
quadrupole: -43.3733 -52.7017 -52.2506
quadrupole: 1.3398 3.2909 -1.6516
quadrupole: 6.0686 -3.2598 -2.8087 1.3398 3.2909 -1.6516
hfenergy: -365.8559811 hartree
pointgroup: C01 [X(C6H13N1O1)]
dipole: -0.0907089 -0.5242142 0.2126301 debye
dipolederiv: -0.5215329 0.2696703 0.150759 0.2386452 -0.7142944 0.0732826 0.1867499 0.0630588 -0.4669279 -0.6039508 0.2577121 -0.1102266 0.2882441 -0.2343983 -0.0300664 -0.1591287 -0.0097465 -0.3666169 0.1065856 -0.0455353 -0.0467753 -0.0959875 0.0264663 0.0607004 -0.0208858 0.0646531 0.2070568 0.0845927 -0.0762484 0.0211469 -0.0928425 0.0991464 0.1013487 0.037957 0.0917491 0.1386648 0.3276226 -0.144827 -0.0334203 -0.236015 0.2135563 0.0083776 -0.0665239 0.0498377 0.2763599 0.4649881 -0.1997234 -0.0851919 -0.1402603 0.528222 0.0222431 -0.0834673 -0.0243468 0.3866781 -0.0101453 -0.0291052 0.0053971 0.0061187 -0.092247 0.0195878 -0.0030145 0.0494788 0.0947697 -0.0394206 -0.0570308 -0.0224959 -0.0837515 0.0148931 0.0194479 -0.0011117 0.0351141 0.0928084 0.0043752 -0.0240279 0.0103401 -0.0704707 -0.0131371 -0.1189412 -0.0769085 -0.1302669 -0.0211651 -0.1005192 -0.0123626 0.0848847 -0.0189474 0.0846271 -0.0340566 0.1249954 -0.0224712 0.0115615 0.1106692 0.0095082 0.0196075 0.0521219 -0.1319469 -0.0225368 0.0208562 -0.0509201 0.0481405 0.0848165 0.0128875 0.0974133 0.0181134 0.0278914 -0.0196781 0.0629617 0.0573857 -0.1273823 0.0065964 -0.0516792 0.0253024 -0.0108577 -0.1226315 0.0588332 0.0312426 0.0722507 0.0555723 -0.0162515 0.0337483 -0.0315314 0.0516018 0.0336442 0.0104607 0.033747 -0.0983044 -0.2226135 0.0102086 0.0244837 -0.0263106 0.0119915 -0.0264164 -0.025315 0.0008548 -0.0212465 -0.2157598 -0.0091378 0.0933475 0.0411121 0.131978 -0.0420549 -0.0406214 0.0503139 -0.051904 0.0511843 0.0372825 -0.0279446 -0.0621792 -0.0268756 0.0564548 -0.0163167 -0.0553866 0.0256317 -0.164895 0.0450456 -0.0556907 0.0079561 -0.1070965 -0.140801 0.0646611 0.0217825 0.0739879 0.0789948 0.0531636 -0.0042625 -0.0145082 0.0158755 0.0989918 0.0338754 -0.076925 -0.0009693 -0.1715833 -0.0584584 0.0850788 0.0492204 0.1587597 -0.0158701 -0.0854781 0.0682161 -0.0780413 0.0344018 0.0234698 -0.0579987 -0.0805002 -0.0903451 0.3499041 -0.0798084 -0.0963253 -0.0949308 0.2807509 unknown
polarizability: 89.2192953|0.6424641|72.7761334|-0.0430905|-0.7782064|60.3470655 unknown
InChI: InChI=1S/C6H13NO/c1-2-6(8)5-7-3-4-7/h6,8H,2-5H2,1H3
charge 0 multiplicity 1
21 atoms
O  -1.766476 1.660167 0.210058
N  1.479886 -0.001844 -0.533519
C  2.895453 0.138074 -0.033388
C  2.04243 -1.040993 0.407885
C  0.500781 0.959367 0.046337
C  -0.936131 0.561646 -0.331822
C  -1.365147 -0.814067 0.220165
C  -2.823474 -1.183319 -0.129016
H  3.105481 0.913305 0.717166
H  3.676266 0.00265 -0.788287
H  2.20599 -2.031918 -0.028054
H  1.685908 -1.042138 1.44763
H  0.703802 1.95591 -0.385848
H  0.570504 1.04872 1.15744
H  -1.011991 0.539185 -1.441428
H  -0.680644 -1.575584 -0.19887
H  -1.232548 -0.817346 1.320738
H  -3.061518 -2.21057 0.200359
H  -2.99848 -1.134176 -1.221203
H  -3.54914 -0.511873 0.369349
H  -2.708851 1.504404 -0.04969
