program: Gaussian 09
title: 000236111
version: EM64L-G09RevD.01
frameworkgroup: C1[X(C10H17NO2)]
method: RPBEPBE
basis: SDD
operation: Freq
keyword: #p
keyword: freq=noraman
keyword: PBEPBE/SDD
title: #p freq=noraman PBEPBE/SDD
converged: NO YES NO NO
title: Mulliken charges:
elementType: O O N C C C C C C C C C C H H H H H H H H H H H H H H H H H
charge: -0.212788 -0.212862 -0.163938 -0.364440 -0.375432 -0.356554 -0.359355 -0.511216 -0.511171 0.172647 0.172567 -0.355850 -0.695400 0.217601 0.218034 0.241059 0.240900 0.193493 0.194051 0.192934 0.193214 0.263595 0.262216 0.262182 0.263583 0.196565 0.196863 0.210606 0.210571 0.216326
chargesum: 0.00000
title: Mulliken charges with hydrogens summed into heavy atoms:
elementType: O O N C C C C C C C C C C
charge: -0.212788 -0.212862 -0.163938 0.071194 0.106527 0.030990 0.026793 0.014595 0.014594 0.172647 0.172567 0.037578 -0.057897
polarizability: 1.43280237e+02 2.03456798e-02 1.21209719e+02 7.42955656e+00 -2.15597505e-02 9.18942319e+01
1716.lowfreq: -26.6477 -7.2421 -4.1036 -0.0004 0.0005 0.0006 8.3923 36.5792 51.4303
frequency: -13.0183 36.1775 51.3616 55.2256 82.1910 107.2108 116.1012 127.0150 140.0791 227.2800 237.3082 269.2430 288.9530 369.3252 425.0578 457.5255 540.1485 543.7779 577.5747 609.7224 654.3109 722.5116 725.1917 741.4487 781.8626 823.5478 869.7618 890.0117 952.3642 1000.4788 1006.1760 1010.9508 1014.4468 1027.5160 1060.4238 1074.3684 1080.7375 1120.7978 1131.6425 1141.2870 1189.4625 1206.8923 1229.5842 1238.0894 1250.9658 1269.1320 1287.8077 1289.0291 1294.6489 1295.9393 1338.3556 1341.4184 1345.9794 1356.9196 1376.3377 1391.7948 1439.0548 1447.5207 1455.1485 1463.7672 1464.0008 1471.9513 1479.0994 1480.7945 1487.5175 1625.9103 1692.1944 2953.5922 2957.5912 2968.0400 2972.2806 2985.4342 2990.3160 3006.6752 3014.1904 3026.0866 3029.4132 3035.8698 3047.1134 3068.7387 3071.1894 3078.4799 3084.0094 3096.4275
redmass: 3.0422 2.1296 3.5383 2.6797 1.8225 5.1454 1.7980 2.1589 4.9373 4.3094 1.1174 2.7123 3.9904 6.6317 2.8177 3.8383 4.0505 3.4850 3.1951 5.6241 5.7775 4.9157 1.0671 1.1107 1.2131 1.5295 1.3282 1.8999 1.7532 3.8163 1.4348 2.1469 2.7928 3.0614 3.7946 3.8110 2.2877 2.6299 2.6411 1.2280 1.9191 1.1136 1.7319 1.2847 1.6696 1.3263 1.1762 1.3043 1.3068 1.1180 1.8240 1.3558 2.2727 1.6384 1.6364 1.2172 1.0760 1.0951 1.0990 1.0775 1.0662 1.0765 1.0420 1.0786 1.0872 12.1469 11.2910 1.0589 1.0588 1.0587 1.0368 1.0588 1.0980 1.1015 1.0579 1.0593 1.1040 1.0634 1.1042 1.1008 1.0993 1.1033 1.1064 1.1016
irintensity: 0.1423 0.1760 1.2959 0.2374 0.0002 12.1549 0.1744 0.0119 2.0289 2.5028 0.0298 4.5910 1.7895 19.2511 0.9215 1.3958 0.0248 0.0076 5.9113 4.7236 36.1147 0.6730 11.8542 3.3237 9.2153 16.9339 1.2801 3.3158 5.7867 19.5903 0.5113 0.0053 10.8070 4.7746 2.9275 7.4864 0.8250 10.7788 126.8782 0.8663 31.0471 0.0537 37.9356 1.4210 32.8309 9.6400 4.0652 0.5840 0.1118 0.3812 72.9158 38.7352 97.6331 0.4345 46.9454 11.2441 0.6577 23.7187 17.9122 1.0645 0.1397 1.2332 12.5048 4.6789 22.9263 571.6886 11.7959 0.5123 10.9238 87.4004 33.2717 29.7759 0.4379 0.4953 30.7778 13.6196 26.8240 3.4507 45.8595 87.8290 53.4046 0.0015 15.9865 9.5196
temp: 298.150 k
press: 1.00000 atm
elementType: 8 8 7 6 6 6 6 6 6 6 6 6 6 1 1 1 1 1 1 1 1 1 1 1 1 1 1 1 1 1
symmnumber: 1
zpe: 674011.2 jmol-1
zpe.correction: 0.256717 hartree
zpe.thermalcorrener: 0.270452 hartree
zpe.thermalcorrenthalpy: 0.271396 hartree
zpe.thermalcorrgfe: 0.214480 hartree
zpe.sumelectzpe: -595.470789 hartree
zpe.sumelectthermal: -595.457055 hartree
zpe.sumelectthermalent: -595.456110 hartree
zpe.sumelectthermalfe: -595.513026 hartree
dipole: 0.9918 -0.0021 0.8410
dipole: 1.3004
quadrupole: -65.0528 -97.0224 -76.5719
quadrupole: -0.0110 4.5406 0.0201
quadrupole: 14.4963 -17.4734 2.9771 -0.0110 4.5406 0.0201
hfenergy: -595.7275065 hartree
pointgroup: C01 [X(C10H17N1O2)]
dipole: 0.3907797 0.0331675 -0.3285475 debye
polarizability: 143.3050057|0.8121412|120.9985215|-7.2953866|2.489088|92.0806607 unknown
InChI: InChI=1S/C10H17NO2/c1-2-3-4-5-8-11-9(12)6-7-10(11)13/h2-8H2,1H3
charge 0 multiplicity 1
30 atoms
O  1.89542 -2.331639 0.00451
O  1.851618 2.337139 0.410553
N  1.600455 -0.01086 0.33506
C  -0.877678 0.006471 -0.074199
C  0.267124 -0.076939 0.960199
C  -2.263914 -0.059399 0.603868
C  -3.4310 0.01107 -0.406451
C  3.637955 -0.677506 -0.710102
C  3.624013 0.863826 -0.575188
C  2.310758 -1.152725 -0.10554
C  2.288765 1.202763 0.099807
C  -4.821337 -0.051099 0.266344
C  -5.983808 0.010783 -0.747822
H  -0.775752 -0.826696 -0.796407
H  -0.784759 0.952443 -0.64218
H  0.211557 -1.031674 1.51377
H  0.19772 0.764386 1.673303
H  -2.34473 -0.999244 1.189134
H  -2.359282 0.773702 1.331303
H  -3.339009 -0.822929 -1.133159
H  -3.351473 0.948381 -0.995717
H  4.46951 -1.155151 -0.164313
H  3.698181 -1.02374 -1.756065
H  3.677166 1.38768 -1.54489
H  4.447176 1.25411 0.047312
H  -4.89697 -0.984967 0.860112
H  -4.913765 0.785292 0.989016
H  -5.948663 0.948019 -1.334981
H  -5.932077 -0.833244 -1.461522
H  -6.965798 -0.034352 -0.241955
