program: Gaussian 09
title: 000236105
version: EM64L-G09RevD.01
frameworkgroup: C1[X(C21H29NO3)]
method: RPBEPBE
basis: SDD
operation: Freq
keyword: #p
keyword: freq=noraman
keyword: PBEPBE/SDD
title: #p freq=noraman PBEPBE/SDD
converged: YES YES NO NO
title: Mulliken charges:
elementType: O O O N C C C C C C C C C C C C C C C C C C C C C H H H H H H H H H H H H H H H H H H H H H H H H H H H H H
charge: -0.276991 -0.267222 -0.265593 -0.283221 0.288723 -0.394131 -0.224952 -0.753867 -0.748486 0.182083 -0.316036 0.373290 0.338001 -0.680893 -0.794978 -0.805217 0.497967 -0.483442 -0.568077 -0.573914 0.185899 0.176749 -0.366215 -0.205446 -0.699010 0.245450 0.272894 0.273046 0.201210 0.209904 0.223055 0.217917 0.210745 0.209046 0.253812 0.242997 0.231364 0.215396 0.217986 0.226816 0.219041 0.215275 0.248590 0.266657 0.204947 0.260467 0.260778 0.205038 0.208439 0.231785 0.239485 0.210856 0.223730 0.218253
chargesum: 0.00000
title: Mulliken charges with hydrogens summed into heavy atoms:
elementType: O O O N C C C C C C C C C C C C C C C C C C C C C
charge: -0.276991 -0.267222 -0.265593 -0.283221 0.288723 -0.148680 0.047942 -0.069708 -0.096768 0.182083 -0.106990 0.373290 0.338001 0.047280 -0.134780 -0.122311 0.497967 -0.216785 -0.102663 -0.313137 0.185899 0.176749 0.047262 0.265823 -0.046171
polarizability: 3.39821926e+02 -2.25979921e+01 2.48582329e+02 -9.37626664e+00 -1.42170372e+01 1.78856106e+02
1716.lowfreq: -9.0382 -4.8911 -2.0362 0.0002 0.0004 0.0008 13.5191 15.5894 22.4234
frequency: 12.8372 14.5629 22.2959 35.7464 45.4212 54.8284 65.4556 77.9184 96.6040 99.2983 111.9140 124.2638 135.0365 140.9901 156.6450 165.2986 174.1312 182.3752 190.8147 206.2355 222.1003 232.3124 237.5421 253.1901 267.2555 283.0894 291.5627 306.1815 320.3937 337.6670 347.5018 371.5250 380.6147 388.2421 414.3209 461.5893 467.2440 487.5740 505.5330 511.7969 530.5930 599.9630 605.9929 637.1983 670.1838 674.8207 719.1304 733.0897 738.3160 747.0366 755.6820 806.5120 814.1431 823.6262 832.7183 849.0801 863.0417 870.5163 875.9228 885.0061 893.7682 919.8139 949.1402 957.5412 971.6809 972.6748 989.4031 996.2264 1009.5181 1035.0180 1050.2992 1053.0247 1072.3388 1073.8521 1076.1722 1082.2825 1095.2672 1100.5661 1105.2899 1113.9258 1124.7631 1131.6462 1160.4756 1162.8983 1188.9556 1207.0063 1214.6714 1233.3094 1239.0372 1255.3565 1277.0073 1281.2115 1295.8928 1320.7831 1338.0020 1342.0023 1359.1020 1376.2217 1385.8480 1386.4008 1390.2660 1398.7023 1400.9064 1403.0454 1414.0888 1419.7901 1440.9952 1455.3264 1463.1427 1465.1995 1467.8769 1469.6762 1471.1409 1473.0193 1475.6312 1476.8360 1479.5028 1481.1463 1483.9461 1485.1367 1489.5414 1490.1911 1496.7314 1561.2283 1620.5938 1623.0140 1681.6694 2954.9419 2960.4307 2964.0725 2969.4967 2970.0545 2973.0416 2982.8186 2993.0361 2994.0491 3024.4157 3027.3645 3028.0047 3052.7081 3053.3194 3053.6756 3059.9261 3070.4007 3071.7959 3073.6334 3075.7788 3084.4817 3092.4660 3094.6694 3108.3675 3110.6372 3113.1519 3135.2032 3165.2663 3171.9708
redmass: 3.0763 3.9977 3.9655 2.9108 4.1754 2.2817 4.1390 3.7906 2.5546 2.8172 2.1771 1.1480 2.7973 2.2706 1.2191 2.9271 1.2750 1.2773 2.3566 3.7348 1.7205 1.4008 2.4536 2.5746 2.8123 3.6970 3.6978 3.6709 3.5609 3.1067 4.8349 2.8797 2.6910 4.0993 2.5675 2.4353 4.0162 3.8816 2.7432 3.7915 4.9992 5.9044 4.4671 4.5444 7.9270 9.0301 5.2774 4.9201 1.1906 4.7143 3.9715 3.9666 3.2635 2.4412 6.0545 2.2506 1.5144 1.3811 1.9752 1.9144 1.8066 2.8581 1.3896 1.3959 4.6985 1.6161 1.2622 2.4215 1.6842 1.7003 2.8342 1.6257 1.5133 1.5312 1.3809 1.6128 2.1000 1.7148 1.5570 2.1511 1.7715 1.1014 2.1245 2.1802 1.9796 3.0353 1.5940 2.4155 1.7359 2.0176 1.2424 1.5263 1.7282 2.1092 1.5182 2.2185 1.3048 1.7814 1.2565 1.2138 1.3016 1.2434 1.2440 7.0986 3.2663 2.8344 1.2532 1.0502 1.0596 1.0570 1.1645 1.5928 1.0558 1.0502 1.0700 1.0576 1.0498 1.0732 1.1442 1.4114 1.1104 1.0611 1.1297 7.3317 8.1659 9.5919 6.3588 1.0375 1.0390 1.0406 1.0367 1.0352 1.0363 1.0602 1.0631 1.0623 1.0966 1.0960 1.0960 1.0959 1.0988 1.1003 1.0985 1.0996 1.1013 1.0978 1.0982 1.0900 1.0987 1.0963 1.0984 1.0876 1.1087 1.0883 1.0925 1.0931
irintensity: 0.0902 0.1087 0.2511 1.2785 1.4468 0.3548 0.4354 1.8570 4.9645 8.0667 5.0701 0.0818 1.0994 0.5316 0.0998 1.0137 0.3801 0.4697 1.5645 0.0599 2.2169 0.8911 4.2620 3.5410 0.3400 2.0400 4.1238 0.3704 7.6466 0.4246 1.4726 4.3588 4.4508 2.7913 2.5803 2.3780 8.6948 2.9490 6.3803 12.3571 2.7689 5.7274 1.4222 4.7836 0.7600 0.5175 0.4168 7.5517 10.2719 2.8695 0.6792 27.5581 2.9880 5.7028 28.2858 21.8619 4.4544 12.7621 14.1654 32.2919 1.1479 8.7292 1.9005 3.4316 146.5097 52.8516 2.1224 3.6638 4.6996 6.2457 2.1973 20.9497 3.2151 14.0687 11.8703 2.1287 11.3310 13.7814 138.4633 118.0955 29.4203 0.2201 37.8514 2.7421 1.3729 25.9560 10.7557 60.5717 89.5189 145.8635 3.4501 15.8780 37.3908 13.9975 1.6807 31.5131 0.0960 115.0857 13.9726 5.6363 34.5278 21.3372 17.9326 1.5560 3.9673 153.6038 33.7573 1.3988 16.4056 8.5183 20.5402 160.2204 7.8730 12.8373 12.6321 19.3439 6.9805 3.7641 41.3813 35.4429 58.4332 20.5327 33.6108 109.0607 1.5371 1.1210 4.2156 40.5001 67.8742 50.0559 26.5474 39.4985 65.7254 12.9751 48.1718 131.3620 0.5145 55.5454 10.3765 21.3259 14.4261 2.1449 56.0019 57.3701 77.4086 19.4952 32.4762 41.1698 5.7413 25.9275 19.7189 4.8481 31.8607 12.9417 5.0336 0.8281
temp: 298.150 k
press: 1.00000 atm
elementType: 8 8 8 7 6 6 6 6 6 6 6 6 6 6 6 6 6 6 6 6 6 6 6 6 6 1 1 1 1 1 1 1 1 1 1 1 1 1 1 1 1 1 1 1 1 1 1 1 1 1 1 1 1 1
symmnumber: 1
zpe: 1186925.2 jmol-1
zpe.correction: 0.452076 hartree
zpe.thermalcorrener: 0.479986 hartree
zpe.thermalcorrenthalpy: 0.480931 hartree
zpe.thermalcorrgfe: 0.390993 hartree
zpe.sumelectzpe: -1096.099033 hartree
zpe.sumelectthermal: -1096.071123 hartree
zpe.sumelectthermalent: -1096.070179 hartree
zpe.sumelectthermalfe: -1096.160116 hartree
dipole: -0.7883 -0.1004 2.9277
dipole: 3.0336
quadrupole: -137.5629 -145.6275 -150.5078
quadrupole: -3.1855 -4.4191 -4.1705
quadrupole: 7.0032 -1.0614 -5.9418 -3.1855 -4.4191 -4.1705
hfenergy: -1096.5511092 hartree
pointgroup: C01 [X(C21H29N1O3)]
dipole: 0.2309685 -0.6661978 0.9629824 debye
polarizability: 333.7043829|-36.8088138|217.6695208|-0.1095725|37.4675752|215.8864568 unknown
InChI: InChI=1S/C21H29NO3/c1-7-8-14-10-17-18(25-12-24-17)11-16(14)22(6)20(23)19-15(9-13(2)3)21(19,4)5/h9-11,15,19H,7-8,12H2,1-6H3
charge 0 multiplicity 1
54 atoms
O  0.553092 1.251148 -0.542381
O  -5.148482 1.593716 1.107713
O  -5.640357 0.385264 -0.904825
N  -0.416695 0.039548 1.200999
C  3.016265 1.637571 1.431472
C  2.022609 0.447878 1.217523
C  3.286211 0.630073 0.306493
C  2.58799 3.048806 1.033591
C  3.851524 1.585584 2.710733
C  0.687122 0.624368 0.560882
C  4.390673 -0.366568 0.325997
C  4.789792 -1.145398 -0.724767
C  -1.726089 0.089587 0.572543
C  -0.326891 -0.548885 2.558491
C  5.958391 -2.106578 -0.582954
C  4.12962 -1.140197 -2.092247
C  -2.003418 -0.638146 -0.622175
C  -2.723017 0.880255 1.216171
C  -0.954371 -1.500899 -1.308115
C  -3.31144 -0.563784 -1.188019
C  -3.989605 0.916517 0.639513
C  -4.277271 0.208719 -0.54406
C  -0.654664 -2.833736 -0.567464
C  -6.129766 1.460402 -0.002073
C  0.437965 -3.658677 -1.280735
H  2.102071 -0.345015 1.967127
H  2.992277 1.005781 -0.68129
H  1.94597 3.036833 0.137399
H  2.027103 3.537059 1.853842
H  3.481297 3.66596 0.819751
H  4.814703 2.110905 2.565263
H  3.315929 2.087467 3.538375
H  4.074673 0.553035 3.033152
H  4.938322 -0.479069 1.273546
H  -1.346685 -0.680051 2.951862
H  0.229435 0.11055 3.247314
H  0.160916 -1.543669 2.545901
H  5.646655 -3.148421 -0.798864
H  6.763189 -1.863559 -1.305794
H  6.393049 -2.081136 0.431678
H  4.862652 -0.881586 -2.882235
H  3.747699 -2.151776 -2.339291
H  3.284199 -0.437543 -2.163862
H  -2.485984 1.45644 2.114328
H  -1.301225 -1.743015 -2.331321
H  -0.017021 -0.927769 -1.424283
H  -3.547447 -1.107484 -2.106967
H  -0.334465 -2.612595 0.468709
H  -1.586783 -3.427715 -0.489728
H  -6.168143 2.413235 -0.564605
H  -7.103939 1.163361 0.414173
H  0.138131 -3.903351 -2.31741
H  1.387922 -3.092962 -1.330659
H  0.635813 -4.60958 -0.75262
