program: Gaussian 09
title: 000236101
version: EM64L-G09RevD.01
frameworkgroup: C1[X(C12H16O2)]
method: RPBEPBE
basis: SDD
operation: Freq
keyword: #pfreq=noraman
keyword: PBEPBE/SDD
title: #p freq=noraman PBEPBE/SDD
converged: YES YES NO NO
title: Mulliken charges:
elementType: O O C C C C C C C C C C C C H H H H H H H H H H H H H H H H
charge: -0.323238 -0.274324 0.338239 -0.711853 -0.704159 -0.712051 0.068521 0.211227 0.354995 -0.325465 -0.407403 -0.784745 -0.237766 -0.219027 0.220909 0.210465 0.267591 0.227207 0.227048 0.205073 0.267659 0.210457 0.220941 0.274605 0.233057 0.207912 0.246902 0.246866 0.230980 0.229378
chargesum: 0.00000
title: Mulliken charges with hydrogens summed into heavy atoms:
elementType: O O C C C C C C C C C C C C
charge: -0.323238 -0.274324 0.338239 -0.012888 -0.044831 -0.012995 0.068521 0.211227 0.354995 -0.050860 -0.174345 -0.083065 -0.006786 0.010352
polarizability: 1.84065925e+02 5.12049071e+00 1.45547428e+02 3.50069372e-02 -1.49442303e-02 8.29495753e+01
1716.lowfreq: -21.7408 -9.4074 -5.6423 0.0005 0.0009 0.0010 17.0338 51.5334 106.4133
frequency: 10.6735 51.5235 106.3992 106.9289 134.7198 170.5231 188.1433 217.9628 227.0797 229.6258 238.6032 251.8872 321.5629 331.7965 372.4543 396.9775 419.8157 433.7305 448.6812 479.0942 492.8670 551.7782 654.6613 682.0549 717.2516 737.0287 774.7293 790.4525 803.9952 840.9689 882.8523 915.8545 920.8688 951.7756 969.9522 995.7963 1000.1146 1026.4509 1030.8010 1033.9773 1044.9825 1050.2963 1133.0207 1171.7059 1176.7685 1209.6510 1236.1503 1255.7314 1270.0104 1282.1799 1372.8073 1373.1139 1375.5675 1397.6718 1404.5503 1424.3441 1443.0453 1454.8517 1465.4554 1466.2266 1467.0315 1468.9652 1475.0886 1479.1749 1500.7115 1573.1163 1598.4225 1615.0421 2988.8830 2989.5220 2991.3453 2994.8132 3078.8944 3080.5774 3083.3514 3089.3946 3095.4377 3097.7610 3114.1115 3118.1290 3122.9704 3138.7513 3157.1035 3183.6635
redmass: 3.3659 3.9562 3.9063 3.2467 3.6770 1.1171 1.1004 2.8717 1.1550 2.8826 1.0889 2.9651 4.1246 2.5708 4.1503 2.5617 3.0142 3.4123 3.0334 2.9410 3.3126 5.9765 6.4176 4.6007 5.6000 1.7597 6.2490 2.0902 3.8069 4.4124 1.3080 1.5970 1.6482 1.2027 1.3849 1.5811 1.3411 1.4167 1.6495 4.0238 1.5791 2.1831 1.7224 1.8832 1.1305 2.7897 3.5505 3.0293 3.1967 1.4660 1.2368 4.4664 1.3053 1.2211 1.2849 1.8908 1.0474 1.0455 1.0747 1.0578 1.2302 1.0737 2.3400 1.0511 1.0578 7.0120 6.9933 7.1045 1.0363 1.0355 1.0364 1.0365 1.0958 1.0993 1.0991 1.1011 1.0991 1.1005 1.1003 1.0995 1.0862 1.0910 1.0972 1.0955
irintensity: 0.1929 2.3205 1.4403 0.0513 1.2897 0.0003 0.9541 2.1585 0.2796 1.1509 0.2274 0.2473 11.4554 1.9815 1.3165 0.5046 2.0583 2.3029 0.0051 3.9879 7.8933 0.1457 6.2503 15.0889 7.9287 55.4052 1.5552 20.5719 2.9978 15.3001 0.1927 0.6823 0.8224 0.2656 0.5812 0.1235 0.0233 0.0039 52.6514 304.6946 10.8658 8.1785 126.9597 236.0699 13.9566 2.0807 178.4312 27.1666 13.2421 4.1712 42.2991 1.7807 49.6913 32.4709 18.2858 1.8812 0.5396 12.1013 25.7445 2.5799 32.4947 8.6327 12.5098 3.8708 30.2377 43.0702 63.1022 84.3585 25.6193 10.2416 23.6332 32.8914 9.6651 10.1139 18.4653 30.7220 64.1165 31.6805 3.8182 17.2660 4.0813 21.3327 29.8425 8.5006
temp: 298.150 k
press: 1.00000 atm
elementType: 8 8 6 6 6 6 6 6 6 6 6 6 6 6 1 1 1 1 1 1 1 1 1 1 1 1 1 1 1 1
symmnumber: 1
zpe: 654493.7 jmol-1
zpe.correction: 0.249283 hartree
zpe.thermalcorrener: 0.264123 hartree
zpe.thermalcorrenthalpy: 0.265067 hartree
zpe.thermalcorrgfe: 0.206819 hartree
zpe.sumelectzpe: -616.286558 hartree
zpe.sumelectthermal: -616.271719 hartree
zpe.sumelectthermalent: -616.270775 hartree
zpe.sumelectthermalfe: -616.329023 hartree
dipole: 0.3268 -1.4598 -0.0006
dipole: 1.4960
quadrupole: -68.8835 -83.1335 -86.2104
quadrupole: -1.4593 0.0037 -0.0160
quadrupole: 10.5256 -3.7244 -6.8012 -1.4593 0.0037 -0.0160
hfenergy: -616.5358418 hartree
pointgroup: C01 [X(C12H16O2)]
dipole: -0.1072952 -0.5734129 -0.0780541 debye
polarizability: 184.3605573|-3.4082187|144.0064368|-2.247319|8.6149642|84.1959338 unknown
InChI: InChI=1S/C12H16O2/c1-9-7-5-6-8-10(9)11(13)14-12(2,3)4/h5-8H,1-4H3
charge 0 multiplicity 1
30 atoms
O  -1.371686 -0.508532 -0.117343
O  -0.810419 1.742611 0.184857
C  -2.876557 -0.263285 -0.056434
C  -3.292444 0.663096 -1.217117
C  -3.436553 -1.684399 -0.244346
C  -3.248705 0.310519 1.325894
C  0.952323 0.055417 -0.081454
C  -0.461907 0.544236 0.011052
C  2.057046 0.964587 0.026993
C  1.193071 -1.333508 -0.280849
C  3.366657 0.424287 -0.070572
C  1.906291 2.460011 0.238317
C  2.502078 -1.840951 -0.374059
C  3.597488 -0.953666 -0.267627
H  -2.939614 0.254774 -2.180813
H  -4.395459 0.728471 -1.254233
H  -2.881828 1.67561 -1.083648
H  -3.08102 -2.351552 0.559769
H  -3.11637 -2.103015 -1.214052
H  -4.540751 -1.660042 -0.2189
H  -2.835303 1.321783 1.461085
H  -4.349473 0.361767 1.415333
H  -2.868723 -0.344065 2.130305
H  0.331538 -2.000564 -0.360835
H  4.220247 1.1074 0.010838
H  2.89918 2.940095 0.287366
H  1.320558 2.927941 -0.571813
H  1.352099 2.686338 1.165672
H  2.667458 -2.912691 -0.527462
H  4.624176 -1.330773 -0.337425
