program: Gaussian 09
title: 000236091
version: EM64L-G09RevD.01
frameworkgroup: C1[X(C12H16O2)]
method: RPBEPBE
basis: SDD
operation: Freq
keyword: #pfreq=noraman
keyword: PBEPBE/SDD
title: #p freq=noraman PBEPBE/SDD
converged: YES YES NO NO
title: Mulliken charges:
elementType: O O C C C C C C C C C C C C H H H H H H H H H H H H H H H H
charge: -0.309235 -0.265978 0.068239 -0.376819 -0.708781 -0.690112 0.217086 0.194669 0.447260 -0.345198 -0.339120 -0.378295 -0.377533 -0.805018 0.226098 0.207690 0.193905 0.218485 0.252239 0.212086 0.236351 0.209849 0.214479 0.268517 0.267023 0.234386 0.232472 0.227405 0.239638 0.228212
chargesum: 0.00000
title: Mulliken charges with hydrogens summed into heavy atoms:
elementType: O O C C C C C C C C C C C C
charge: -0.309235 -0.265978 0.294337 0.024776 -0.025971 -0.029433 0.217086 0.194669 0.447260 -0.076682 -0.072097 -0.143909 -0.145061 -0.109763
polarizability: 1.99195174e+02 -7.33110637e+00 1.28014124e+02 3.50091657e+00 1.46585675e+01 9.19179102e+01
1716.lowfreq: -17.8236 -3.4486 -0.0007 0.0007 0.0009 5.4774 29.4315 40.9862 52.4252
frequency: 28.4115 40.9366 52.0115 72.5759 90.6472 103.3540 121.3522 191.0122 202.3318 207.7174 247.1380 270.4330 298.9067 343.4165 378.1196 399.4090 407.2347 465.7690 480.8056 497.4584 594.5546 634.4000 679.2841 739.6544 748.2045 764.8992 814.8038 818.8438 846.0644 861.6796 870.4261 965.1367 981.8583 988.2323 992.6409 995.2349 1010.8973 1035.9377 1047.1208 1060.2879 1110.7355 1121.1964 1127.1547 1177.0307 1185.5144 1223.3345 1244.1341 1263.0808 1295.0760 1305.5370 1333.3863 1357.3063 1376.7411 1386.4469 1390.5140 1397.2124 1409.7887 1453.0155 1465.7299 1470.1693 1474.8909 1474.9559 1478.4670 1488.3740 1501.9762 1574.4764 1612.5790 1621.5993 2976.5442 2981.9495 2984.5944 2989.7548 3015.4021 3040.3561 3058.4571 3076.4074 3084.9351 3088.8956 3090.7705 3101.3648 3126.2055 3128.5944 3159.1884 3173.4092
redmass: 3.3547 3.5014 1.0277 4.5684 4.4984 2.3222 2.8715 1.7436 1.3091 1.6657 2.3010 4.1859 4.3396 3.2962 3.2087 3.0660 2.8582 3.1694 3.4159 3.0214 5.5249 6.9515 4.5210 3.0376 1.8536 4.7607 2.5497 2.7646 1.5511 1.2567 2.3285 1.2746 1.3411 1.4103 1.3902 1.3731 3.3903 3.1979 1.5967 4.5431 1.7975 1.3074 2.2066 1.8201 1.2136 3.0024 2.6091 1.3012 1.3287 1.2827 1.3307 1.7106 5.0896 1.2223 1.2131 1.2214 3.5245 1.0749 1.0579 1.1036 1.0455 1.0562 1.0455 1.0538 2.6998 6.8801 10.3949 6.3578 1.0390 1.0419 1.0500 1.0407 1.0869 1.0991 1.0943 1.0996 1.0987 1.1000 1.1000 1.1005 1.0895 1.0895 1.0954 1.0948
irintensity: 0.2001 1.3526 0.7083 1.0380 0.6687 0.4847 0.1906 0.4410 1.1802 1.7239 4.5459 1.5961 3.2108 2.9240 4.5153 5.5271 0.0584 9.2367 3.7003 0.6159 3.4543 1.3361 20.7408 21.6505 2.7766 0.9027 8.8313 8.5007 32.6939 1.7360 28.3767 8.8478 3.1520 1.3910 48.7700 0.5055 53.8550 6.5598 34.8459 299.7019 14.5153 8.0007 13.6950 65.3617 40.2116 1.0975 287.3200 39.4100 3.9993 1.5212 10.6105 4.1240 3.0791 18.9869 20.7976 13.1637 8.6021 3.1758 12.9263 15.1796 7.7370 11.7476 17.7072 10.1235 11.7677 36.4379 164.8182 64.2068 28.5823 34.4993 13.2974 39.5944 5.6937 16.3378 21.9594 39.4835 28.8769 16.8797 66.5955 20.2919 17.5634 14.7965 8.3689 3.2593
temp: 298.150 k
press: 1.00000 atm
elementType: 8 8 6 6 6 6 6 6 6 6 6 6 6 6 1 1 1 1 1 1 1 1 1 1 1 1 1 1 1 1
symmnumber: 1
zpe: 656429.6 jmol-1
zpe.correction: 0.250021 hartree
zpe.thermalcorrener: 0.265109 hartree
zpe.thermalcorrenthalpy: 0.266053 hartree
zpe.thermalcorrgfe: 0.206334 hartree
zpe.sumelectzpe: -616.288506 hartree
zpe.sumelectthermal: -616.273418 hartree
zpe.sumelectthermalent: -616.272474 hartree
zpe.sumelectthermalfe: -616.332194 hartree
dipole: -0.7723 2.0387 0.9099
dipole: 2.3624
quadrupole: -64.2570 -85.9734 -86.0822
quadrupole: 0.9745 1.9599 0.2764
quadrupole: 14.5139 -7.2026 -7.3113 0.9745 1.9599 0.2764
hfenergy: -616.5385273 hartree
pointgroup: C01 [X(C12H16O2)]
dipole: 0.2993896 0.771439 -0.4231938 debye
polarizability: 199.1741787|7.7321854|125.4607782|2.4327079|-17.4073312|94.4922513 unknown
InChI: InChI=1S/C12H16O2/c1-4-10(3)14-12(13)11-7-5-9(2)6-8-11/h5-8,10H,4H2,1-3H3
charge 0 multiplicity 1
30 atoms
O  -1.615828 0.115207 -0.271055
O  -1.058926 -1.856289 0.852599
C  -3.078262 -0.236552 -0.169095
C  -3.82811 1.103576 -0.18334
C  -3.438881 -1.169849 -1.333242
C  -3.519004 1.991428 1.039609
C  0.705851 -0.351087 0.095606
C  -0.706021 -0.794544 0.275644
C  3.440899 0.408446 -0.202858
C  1.739713 -1.173823 0.612499
C  1.044985 0.852249 -0.575103
C  3.087803 -0.796801 0.46173
C  2.397243 1.221283 -0.72041
C  4.893212 0.828608 -0.334831
H  -3.21746 -0.761119 0.795707
H  -3.576892 1.640231 -1.118987
H  -4.912534 0.878694 -0.225053
H  -3.246454 -0.677019 -2.302949
H  -2.851501 -2.101837 -1.282487
H  -4.510692 -1.436966 -1.284788
H  -2.439377 2.215457 1.093864
H  -3.809574 1.488646 1.981139
H  -4.067265 2.949231 0.984378
H  1.462636 -2.102217 1.122972
H  0.246267 1.480461 -0.979119
H  3.879079 -1.442082 0.861705
H  2.651153 2.15119 -1.243341
H  5.05633 1.449143 -1.233268
H  5.210221 1.428498 0.540679
H  5.565487 -0.045264 -0.392702
