program: Gaussian 09
title: 000236088
version: EM64L-G09RevD.01
frameworkgroup: C1[X(C13H16O3)]
method: RPBEPBE
basis: SDD
operation: Freq
keyword: #pfreq=noraman
keyword: PBEPBE/SDD
title: #p freq=noraman PBEPBE/SDD
converged: YES YES NO NO
title: Mulliken charges:
elementType: O O O C C C C C C C C C C C C C H H H H H H H H H H H H H H H H
charge: -0.274937 -0.280545 -0.275436 -0.022407 -0.465826 -0.476568 -0.292924 -0.331368 0.183697 0.072052 0.368528 -0.327803 -0.400960 -0.779640 -0.239437 -0.218816 0.232883 0.219595 0.261859 0.237620 0.233318 0.221558 0.200413 0.243098 0.242767 0.274315 0.231902 0.238130 0.212523 0.245456 0.235548 0.231407
chargesum: 0.00000
title: Mulliken charges with hydrogens summed into heavy atoms:
elementType: O O O C C C C C C C C C C C C C
charge: -0.274937 -0.280545 -0.275436 0.210476 0.015628 -0.005631 0.129048 0.154497 0.183697 0.072052 0.368528 -0.053489 -0.169058 -0.083531 -0.003889 0.012591
polarizability: 2.08268000e+02 -3.53132955e+00 1.47008566e+02 1.44881616e+01 4.10120271e+00 9.16959440e+01
1716.lowfreq: -8.1486 -4.9619 0.0004 0.0005 0.0006 8.2466 18.0415 31.6069 41.6591
frequency: 17.7224 31.4944 39.1325 70.6430 82.1088 125.1495 158.5100 201.3756 204.5272 224.8709 250.6666 274.3424 325.1128 358.7308 386.6749 429.5946 447.2915 495.6859 513.9430 547.9350 588.0785 645.5836 678.7004 687.8187 736.7311 741.3334 789.6275 810.3777 819.8367 832.3620 861.0999 886.8568 889.0166 902.0013 919.9820 976.4280 990.6209 994.6417 996.7623 1004.4060 1026.3828 1035.1802 1045.7466 1062.2982 1088.3084 1116.0791 1129.8400 1154.0874 1172.5236 1177.0234 1210.9274 1217.9673 1230.7365 1232.7674 1262.7229 1285.4043 1302.4332 1312.9287 1328.1529 1341.0304 1365.3656 1373.8075 1403.2970 1429.5944 1451.2277 1459.5113 1459.8039 1471.4333 1473.4257 1476.2514 1490.6497 1569.7197 1594.6906 1615.6843 2979.0114 2993.3160 3011.8863 3018.7954 3029.4211 3042.5104 3064.9560 3081.2887 3086.7761 3091.4565 3099.9021 3121.6003 3124.8454 3140.2252 3153.8801 3169.7245
redmass: 4.2126 4.1221 3.7207 6.4919 3.9718 3.9337 3.6653 1.1734 2.7146 2.7031 2.9433 4.2764 3.8370 4.3005 2.5972 3.4435 3.3283 3.2738 4.9089 5.5996 1.9770 5.8042 4.7091 5.2907 1.9318 5.1706 1.8760 3.8057 2.7893 2.6320 2.4293 1.3058 1.7094 6.7849 2.6977 1.3778 1.8558 2.1673 1.6203 1.3414 3.2621 3.4762 1.5744 2.4845 1.4908 1.8008 1.4315 1.5533 1.7731 1.0691 2.4960 1.2801 1.8956 1.6399 1.2448 1.4973 1.3898 1.2657 1.3198 1.3408 1.5268 4.7287 1.2796 2.0250 1.1036 1.0842 1.0592 1.3126 1.1302 1.8487 1.0946 6.9562 7.8306 6.6049 1.0650 1.0363 1.0702 1.0615 1.0804 1.0581 1.0996 1.0964 1.1020 1.1009 1.1040 1.1089 1.0863 1.0899 1.0940 1.0999
irintensity: 0.3117 2.2514 1.0655 2.8851 1.5915 0.4728 1.7278 0.3724 2.0444 5.7981 3.7655 0.8616 12.7857 12.6771 2.6590 4.8480 4.2602 6.7204 3.3604 0.1155 5.0466 4.9954 15.8908 5.4212 50.1877 5.6859 26.3274 3.2108 9.8595 5.0181 4.2357 0.6574 3.7460 46.2819 9.3784 0.9828 10.6786 40.6044 0.1902 0.2028 135.0322 178.1144 10.7624 38.1995 0.1933 50.3804 1.9512 1.5103 2.0798 1.7898 6.8655 4.9227 198.2394 44.2865 1.1685 40.7580 12.7878 2.8689 6.7452 1.8691 11.6740 26.7166 15.4005 23.7420 22.8214 19.2503 3.3845 34.9504 16.5178 7.8553 1.9672 27.8645 156.5995 38.3406 97.9465 20.8081 14.8075 20.0250 33.1526 34.3584 34.8090 12.8448 25.3567 28.0265 35.8011 8.0036 4.6147 16.9415 14.2660 24.7529
temp: 298.150 k
press: 1.00000 atm
elementType: 8 8 8 6 6 6 6 6 6 6 6 6 6 6 6 6 1 1 1 1 1 1 1 1 1 1 1 1 1 1 1 1
symmnumber: 1
zpe: 690929.4 jmol-1
zpe.correction: 0.263161 hartree
zpe.thermalcorrener: 0.278294 hartree
zpe.thermalcorrenthalpy: 0.279238 hartree
zpe.thermalcorrgfe: 0.218503 hartree
zpe.sumelectzpe: -729.451030 hartree
zpe.sumelectthermal: -729.435897 hartree
zpe.sumelectthermalent: -729.434953 hartree
zpe.sumelectthermalfe: -729.495688 hartree
dipole: 0.9780 0.1243 1.4810
dipole: 1.7791
quadrupole: -81.7811 -94.8013 -95.4149
quadrupole: 7.0842 -1.3194 -0.2530
quadrupole: 8.8846 -4.1355 -4.7491 7.0842 -1.3194 -0.2530
hfenergy: -729.7141908 hartree
pointgroup: C01 [X(C13H16O3)]
dipole: 0.3838831 0.051185 0.5830724 debye
polarizability: 207.58026|-6.1382979|147.7171136|15.5139578|1.1521046|91.675137 unknown
InChI: InChI=1S/C13H16O3/c1-10-5-2-3-7-12(10)13(14)16-9-11-6-4-8-15-11/h2-3,5,7,11H,4,6,8-9H2,1H3
charge 0 multiplicity 1
32 atoms
O  -4.209313 1.290369 -0.386039
O  -0.513856 0.791269 -0.708967
O  -0.429544 -1.534488 -0.767564
C  -2.847888 0.992909 0.14386
C  -3.01334 -0.22281 1.084923
C  -4.225928 -0.973279 0.474765
C  -5.128965 0.1866 0.009098
C  -1.957484 0.744303 -1.089749
C  0.154591 -0.432904 -0.587272
C  1.605347 -0.302109 -0.239839
C  2.304869 0.923488 0.018711
C  2.301028 -1.544026 -0.174968
C  3.688067 0.831745 0.331595
C  1.678001 2.30625 -0.014137
C  3.670243 -1.603512 0.135747
C  4.36985 -0.401943 0.391224
H  -2.490645 1.894693 0.674428
H  -3.253115 0.125079 2.106234
H  -2.108996 -0.85039 1.12695
H  -3.902364 -1.592909 -0.380707
H  -4.727878 -1.630165 1.204979
H  -5.751592 -0.055694 -0.869153
H  -5.779897 0.547633 0.830504
H  -2.089894 1.567064 -1.80959
H  -2.180082 -0.226735 -1.563155
H  1.729227 -2.455102 -0.378268
H  4.238318 1.758274 0.532667
H  0.839851 2.390436 0.698951
H  2.432913 3.071853 0.234837
H  1.253524 2.536237 -1.006274
H  4.18517 -2.568891 0.178132
H  5.437879 -0.423647 0.635777
