program: Gaussian 09
title: 000236082
version: EM64L-G09RevD.01
frameworkgroup: C1[X(C11H10O2)]
method: RPBEPBE
basis: SDD
operation: Freq
keyword: #pfreq=noraman
keyword: PBEPBE/SDD
title: #p freq=noraman PBEPBE/SDD
converged: YES YES NO NO
title: Mulliken charges:
elementType: O O C C C C C C C C C C C H H H H H H H H H H
charge: -0.290224 -0.253844 0.359651 0.081558 -0.403895 -0.318886 -0.779660 -0.215183 -0.236191 0.190813 -0.386061 0.246946 -0.472229 0.235471 0.277982 0.245193 0.210713 0.251755 0.231533 0.234006 0.247033 0.264532 0.278986
chargesum: 0.00000
title: Mulliken charges with hydrogens summed into heavy atoms:
elementType: O O C C C C C C C C C C C
charge: -0.290224 -0.253844 0.359651 0.081558 -0.168424 -0.040904 -0.071999 0.016351 -0.002185 0.190813 0.125504 0.246946 -0.193243
polarizability: 1.68372975e+02 2.18272595e+00 1.23749278e+02 2.38371129e+00 1.70958144e-01 7.66321361e+01
1716.lowfreq: -9.3777 -4.7150 0.0004 0.0007 0.0008 0.9640 13.8918 38.9121 48.5544
frequency: 13.4464 38.9104 48.5436 127.2088 167.2239 179.6905 209.8764 245.3291 289.7955 300.4785 329.2937 384.1233 427.5925 448.4365 490.9048 547.6181 562.4017 629.9574 649.6993 679.7023 680.5350 736.4521 739.5865 790.6834 797.2618 881.2070 884.8411 962.5660 972.6473 991.2676 996.4130 1002.5173 1012.6219 1044.1192 1050.9105 1133.4989 1178.1571 1207.6135 1226.7894 1240.2356 1284.9580 1338.7405 1374.6607 1405.2760 1425.8530 1442.3556 1455.6023 1468.4488 1477.2632 1575.6127 1607.8849 1626.1981 2148.1340 2992.1561 3014.6405 3076.8414 3085.9606 3092.3568 3125.9676 3141.7318 3159.5722 3184.7507 3425.2594
redmass: 4.0030 7.0744 5.5342 4.0482 3.0057 1.1692 3.5531 4.2976 4.5879 4.0766 3.0123 5.3972 3.4178 3.8671 3.2768 5.8297 7.1743 1.2340 6.3157 1.5658 2.7383 1.8326 5.2932 1.9825 5.1735 5.8003 1.3645 4.2666 1.3863 2.1997 1.7996 1.3461 4.0259 1.5810 2.2004 1.6735 1.0667 3.1063 2.5860 1.1446 1.4481 1.2796 5.5608 1.2940 1.8822 1.1040 1.0456 1.2311 2.4573 6.7948 6.2695 9.2161 5.9995 1.0365 1.0580 1.0959 1.1036 1.1013 1.0864 1.0911 1.0971 1.0959 1.1603
irintensity: 0.0051 1.1483 0.8990 0.6393 2.1322 0.9093 2.8379 0.5060 2.6310 3.4009 26.8461 1.1733 1.8210 0.4633 6.8980 0.7437 19.4908 73.2681 4.9279 36.8638 39.8185 51.3510 11.2059 26.3064 4.3715 25.8884 2.1465 33.9352 0.7363 80.5485 7.6723 0.3296 310.4790 11.0045 8.1749 35.2804 4.5249 44.4230 212.9730 9.6105 3.1631 27.6189 10.6880 17.9357 1.7060 33.2280 12.5292 35.5095 17.9912 32.6328 10.4485 191.0998 0.9573 18.0675 29.8934 9.8404 3.7320 28.3512 4.0720 19.8782 26.5332 7.0953 62.1926
temp: 298.150 k
press: 1.00000 atm
elementType: 8 8 6 6 6 6 6 6 6 6 6 6 6 1 1 1 1 1 1 1 1 1 1
symmnumber: 1
zpe: 461940.3 jmol-1
zpe.correction: 0.175944 hartree
zpe.thermalcorrener: 0.188478 hartree
zpe.thermalcorrenthalpy: 0.189422 hartree
zpe.thermalcorrgfe: 0.135037 hartree
zpe.sumelectzpe: -574.625901 hartree
zpe.sumelectthermal: -574.613366 hartree
zpe.sumelectthermalent: -574.612422 hartree
zpe.sumelectthermalfe: -574.666808 hartree
dipole: -0.8582 -1.2283 -0.1757
dipole: 1.5086
quadrupole: -61.7558 -74.5984 -73.7023
quadrupole: -1.8133 -1.0601 -0.4736
quadrupole: 8.2630 -4.5796 -3.6835 -1.8133 -1.0601 -0.4736
hfenergy: -574.8018444 hartree
pointgroup: C01 [X(C11H10O2)]
dipole: -0.3049923 -0.4836378 -0.1592645 debye
dipolederiv: -1.7568341 0.250645 0.0044462 0.4210254 -0.5092781 -0.0719537 0.3824486 -0.0770804 -0.3854111 -0.7992147 -0.1944657 -0.0292118 -0.0361547 -0.9252853 -0.1175796 0.110027 -0.1497779 -0.3170897 0.1282975 0.2103457 0.0400565 -0.1832257 0.3820628 0.0844692 -0.0627259 0.0556976 0.0260331 -0.6677853 -0.1533489 0.0082864 -0.2469257 -0.2258079 -0.0097837 0.0295843 -0.0248088 -0.0349586 0.0315828 -0.2438022 -0.0899403 -0.1112809 -0.2815668 -0.0106119 -0.0549169 0.0110268 -0.1673867 0.1049886 -0.0404585 -0.0402821 0.2447538 0.0014628 -0.0001583 0.0418287 0.0314929 -0.0962461 0.1397368 -0.13183 -0.0447634 0.0209188 -0.2144376 -0.0547277 -0.0111535 -0.0441773 0.0134431 0.1588543 0.0208644 -0.0371034 -0.010593 0.1135539 0.0510031 -0.0404004 0.0484912 -0.099065 -0.3260794 0.0543012 0.0224312 0.0238731 0.101487 0.0625273 0.0283471 0.0534551 -0.1639647 2.1922134 0.1247292 -0.1039082 -0.3268236 1.1945426 0.208536 -0.4760119 0.2645141 0.2932444 1.1095335 -0.0976632 0.1776442 0.2304142 0.2087616 -0.0340837 0.1187227 -0.0515883 0.4422527 -0.1522443 -0.0356767 0.0736985 -0.0723057 -0.0635001 0.0218623 0.0435815 -0.0047697 -0.0834709 -0.4099006 0.0283147 -0.0451811 0.0699891 -0.3006027 0.0084583 -0.1558946 0.0154214 -0.3191822 -0.0579957 0.0699265 0.0414671 0.1090319 0.0212498 -0.0438016 0.0537498 -0.0389013 0.1360243 0.0578086 0.0698689 0.0344016 0.0883274 0.0731343 -0.0179341 0.0274524 -0.0282634 0.1417162 0.0833371 -0.0347814 0.0748811 -0.0201058 0.0092621 0.0445101 0.0617184 0.0803121 -0.0108916 -0.1632681 0.1442952 0.0595194 0.017526 0.0544696 -0.0126273 0.0366911 -0.0275083 0.0940592 0.0513054 -0.0104389 -0.0973388 0.0068799 0.0561642 -0.0206009 -0.0836735 -0.0460457 -0.0153135 -0.0837501 -0.0960189 0.0085725 -0.090634 0.0469043 -0.0119467 0.0122892 -0.0106307 0.149039 0.0761308 -0.0113628 0.0075268 -0.0357831 -0.1084966 -0.0594916 0.0011499 -0.0583383 0.1463676 -0.0505447 0.0257785 0.0021919 0.0241118 0.1133229 -0.0716618 0.029845 -0.0237954 -0.0591557 0.0688349 0.0510617 -0.0522274 -0.1235184 -0.0017721 0.0398626 -0.0880825 0.0098003 0.0844917 0.2649936 -0.0002838 -0.0151666 0.0004993 0.2543694 0.0157336 -0.0045766 0.0154741 0.2254646 unknown
polarizability: 167.5279058|3.6867268|122.9068511|7.3662669|7.5964515|78.3196314 unknown
InChI: InChI=1S/C11H10O2/c1-3-8-13-11(12)10-7-5-4-6-9(10)2/h1,4-7H,8H2,2H3
charge 0 multiplicity 1
23 atoms
O  1.576997 -0.252674 -0.773669
O  0.846808 1.825579 -0.003181
C  -1.93541 0.736006 0.062736
C  -0.761195 -0.01567 -0.276637
C  -3.17481 0.044883 0.079508
C  -0.8620 -1.403742 -0.577455
C  -1.920582 2.215091 0.399914
C  -3.269131 -1.330936 -0.220332
C  -2.104718 -2.062061 -0.550573
C  0.576973 0.639078 -0.313408
C  2.969846 0.285543 -0.787725
C  3.725718 -0.152283 0.392064
C  4.386023 -0.512251 1.368206
H  -4.081887 0.604531 0.335244
H  0.050596 -1.949725 -0.828021
H  -1.492475 2.81716 -0.420692
H  -2.944807 2.570363 0.606341
H  -1.284818 2.423771 1.27793
H  -4.245078 -1.828818 -0.195276
H  -2.166173 -3.130459 -0.782422
H  3.412521 -0.114454 -1.714821
H  2.922769 1.389211 -0.830361
H  4.952933 -0.822541 2.22723
