program: Gaussian 09
title: 000236079
version: EM64L-G09RevD.01
frameworkgroup: C1[X(C15H28O2)]
method: RPBEPBE
basis: SDD
operation: Freq
keyword: #pfreq=noraman
keyword: PBEPBE/SDD
title: #p freq=noraman PBEPBE/SDD
converged: YES YES NO NO
title: Mulliken charges:
elementType: O O C C C C C C C C C C C C C C C H H H H H H H H H H H H H H H H H H H H H H H H H H H H
charge: -0.301823 -0.258885 0.361424 -0.515781 -0.492228 0.007331 0.009427 -0.046965 -0.412787 -0.402642 -0.418615 -0.426181 -0.406347 -0.745512 -0.353987 -0.713235 -0.702763 0.212192 0.228221 0.202746 0.225171 0.166575 0.189038 0.227861 0.193939 0.212072 0.206084 0.189970 0.240097 0.179028 0.206557 0.191118 0.194907 0.211034 0.209603 0.213506 0.211360 0.183600 0.231034 0.222951 0.218062 0.217931 0.204472 0.213571 0.216871
chargesum: 0.00000
title: Mulliken charges with hydrogens summed into heavy atoms:
elementType: O O C C C C C C C C C C C C C C C
charge: -0.301823 -0.258885 0.361424 -0.075369 -0.064312 0.173906 0.198464 0.180896 -0.006776 -0.006588 0.000510 -0.028505 -0.000406 -0.111044 0.060646 -0.054291 -0.067848
polarizability: 1.91900982e+02 -5.11491464e+00 1.63657508e+02 1.70175597e+00 5.27681829e-01 1.38197509e+02
1716.lowfreq: -10.2158 -0.0003 0.0007 0.0009 5.2315 11.5962 41.1848 45.5046 59.1286
frequency: 40.7132 45.4576 59.0739 61.0355 69.5818 101.8513 133.9599 166.8880 179.0881 195.1683 205.2033 218.2707 224.8959 233.2205 266.8548 284.4101 291.5890 293.0270 308.0977 346.1449 398.8320 422.5868 444.0590 451.7675 469.7911 484.0010 495.1933 516.8949 580.6349 628.9909 697.0095 744.1306 759.9526 772.6566 773.6026 827.8100 874.2750 881.8217 889.2540 899.5355 905.3323 916.2197 930.6354 937.9808 954.3057 963.3179 988.1954 1013.2372 1026.6807 1035.6496 1040.9257 1050.3274 1075.3859 1080.9339 1087.5444 1095.4434 1107.9738 1128.0775 1146.2136 1147.3133 1154.3561 1155.0854 1196.1256 1214.2161 1231.6508 1238.4066 1248.3050 1257.1297 1267.5042 1275.6438 1284.0542 1293.8671 1298.9883 1300.0534 1305.8768 1321.1971 1325.2827 1330.7560 1340.8268 1342.0224 1349.8173 1357.1233 1360.9959 1365.7506 1385.1737 1387.3882 1392.2734 1449.1560 1450.5330 1453.4310 1465.9722 1467.9913 1469.8348 1472.1594 1474.2258 1475.0021 1476.6057 1477.5258 1481.1445 1485.6920 1488.1775 2907.0864 2935.7381 2939.5742 2962.2179 2964.9326 2967.5302 2970.2319 2972.3105 2978.7829 2979.6162 2980.2260 2989.2356 2992.8009 3004.8702 3025.8940 3029.0978 3029.7317 3038.3503 3046.4180 3051.3278 3060.2621 3064.5257 3070.3299 3071.3685 3072.5098 3074.9992 3075.7032 3082.5193
redmass: 3.5002 3.4135 2.4555 1.5375 2.4252 2.7644 2.5139 2.8619 2.5125 2.4284 1.1765 2.1356 1.1129 1.3320 3.5361 2.8870 2.4519 2.5513 2.8257 2.2935 2.4156 2.3456 2.4386 3.8905 3.5900 3.3178 3.4619 2.7605 3.0290 3.6487 2.4723 1.4113 1.3014 1.9350 1.5302 1.8084 2.3200 2.1773 1.6637 1.8007 2.0831 1.9653 1.6118 2.1543 1.9644 1.5194 2.7535 1.8665 2.1512 2.3762 2.4566 2.3003 2.0960 2.2141 1.3354 2.5618 2.3387 2.0524 1.8712 2.4736 1.9064 2.3867 1.9139 1.3429 1.2964 1.2990 1.4202 1.3251 1.3373 1.4509 1.1779 1.1741 1.2642 1.3872 1.3067 1.3984 1.3779 1.3696 1.4825 1.7071 1.4851 1.4835 1.4803 1.5986 1.2213 1.2185 1.2058 1.0841 1.0809 1.0914 1.0846 1.0770 1.0792 1.0737 1.0530 1.0528 1.0465 1.0569 1.0556 1.0788 1.0551 1.0816 1.0692 1.0825 1.0646 1.0364 1.0556 1.0449 1.0586 1.0406 1.0554 1.0595 1.0797 1.0648 1.0640 1.0959 1.0958 1.0996 1.0997 1.1005 1.1006 1.0990 1.0993 1.0993 1.1006 1.0993 1.1013 1.0983 1.0955
irintensity: 0.2663 0.2000 0.1122 0.0082 0.1893 0.3096 0.1519 0.2076 0.9441 1.7221 0.6176 2.0350 0.0768 0.3248 2.9793 0.6445 3.3722 1.4111 0.1809 1.3313 1.4599 3.5708 0.0260 2.3635 6.1551 4.9570 0.9523 4.7734 6.0110 3.5170 0.9123 6.0010 12.1305 2.1814 2.0673 9.6767 21.9083 40.8063 0.5352 3.1377 25.7435 2.6813 8.6440 20.1368 13.1127 22.0379 10.7920 32.7141 47.2611 1.0881 11.0829 78.5442 23.7190 12.5536 1.0354 11.4815 18.0073 24.5031 18.0747 5.2708 6.1752 10.2397 3.1827 0.8376 4.6328 3.6173 26.9276 4.5233 7.1886 3.0054 0.9972 0.4444 11.5626 0.8479 6.2025 3.5166 4.6782 3.4318 0.7086 4.0640 1.4466 5.9378 1.4671 29.8631 8.7532 10.3682 12.8091 4.0887 3.5838 13.1255 18.0626 5.4182 9.2643 2.6310 1.7909 15.2864 4.9754 12.2311 8.5135 12.1990 11.7777 25.2177 47.0687 21.7170 22.7274 29.3856 31.9614 21.4518 48.7962 57.4599 24.9282 53.6065 22.9347 27.9231 14.0204 23.6492 9.2492 48.9995 32.5924 3.3408 37.2361 79.1677 43.8451 47.6892 78.8707 56.5993 30.3126 68.9194 39.1605
temp: 298.150 k
press: 1.00000 atm
elementType: 8 8 6 6 6 6 6 6 6 6 6 6 6 6 6 6 6 1 1 1 1 1 1 1 1 1 1 1 1 1 1 1 1 1 1 1 1 1 1 1 1 1 1 1 1
symmnumber: 1
zpe: 1060337.2 jmol-1
zpe.correction: 0.403861 hartree
zpe.thermalcorrener: 0.422869 hartree
zpe.thermalcorrenthalpy: 0.423813 hartree
zpe.thermalcorrgfe: 0.357055 hartree
zpe.sumelectzpe: -737.447563 hartree
zpe.sumelectthermal: -737.428555 hartree
zpe.sumelectthermalent: -737.427611 hartree
zpe.sumelectthermalfe: -737.494369 hartree
dipole: 1.1407 0.4230 1.7832
dipole: 2.1587
quadrupole: -100.2269 -110.5250 -107.3863
quadrupole: 0.7116 0.9948 -2.4292
quadrupole: 5.8192 -4.4790 -1.3402 0.7116 0.9948 -2.4292
hfenergy: -737.8514244 hartree
pointgroup: C01 [X(C15H28O2)]
dipole: -0.4529105 0.1641086 -0.6994668 debye
polarizability: 191.6325278|5.7824884|163.9348218|1.7761952|-0.1634459|138.1886487 unknown
InChI: InChI=1S/C15H28O2/c1-4-6-14-13(5-2)11-16-15(17-14)9-7-12(3)8-10-15/h12-14H,4-11H2,1-3H3
charge 0 multiplicity 1
45 atoms
O  0.044196 0.270531 0.581976
O  -0.298643 -2.119297 0.672011
C  0.660042 -1.047269 0.349693
C  1.78632 -1.168754 1.384694
C  1.202403 -1.185714 -1.095718
C  -1.232117 0.509756 -0.140392
C  3.498751 -0.329018 -0.336697
C  -2.24971 -0.614413 0.199866
C  2.937135 -0.177705 1.100347
C  2.348205 -0.183486 -1.3657
C  -1.580603 -1.988187 -0.042065
C  -1.671804 1.920946 0.283597
C  -3.555761 -0.483825 -0.628666
C  4.633802 0.679795 -0.610534
C  -0.663065 3.023107 -0.111329
C  -4.610318 -1.573673 -0.326884
C  -1.130155 4.429479 0.320256
H  2.155301 -2.211516 1.354761
H  1.347961 -0.996083 2.383226
H  0.397261 -1.049789 -1.840944
H  1.571093 -2.224188 -1.206139
H  -1.0407 0.500681 -1.239871
H  3.910474 -1.358418 -0.434278
H  -2.489342 -0.533954 1.28011
H  3.747227 -0.330338 1.840119
H  2.564017 0.857014 1.234077
H  1.949581 0.849795 -1.309577
H  2.735927 -0.330072 -2.393267
H  -2.194527 -2.810837 0.357189
H  -1.442515 -2.153592 -1.134133
H  -1.814126 1.924005 1.382818
H  -2.654267 2.147274 -0.175067
H  -3.304366 -0.502886 -1.710472
H  -4.009444 0.506365 -0.433801
H  4.261984 1.719196 -0.523341
H  5.461962 0.557279 0.112608
H  5.049695 0.554278 -1.628096
H  -0.511574 3.002448 -1.210779
H  0.315136 2.789327 0.347318
H  -4.272382 -2.578016 -0.639114
H  -4.838682 -1.615165 0.754776
H  -5.553934 -1.362199 -0.862226
H  -2.099868 4.690254 -0.145518
H  -1.260661 4.483083 1.41768
H  -0.397314 5.204779 0.030288
