program: Gaussian 09
title: 000236078
version: EM64L-G09RevD.01
frameworkgroup: C1[X(C12H22O2)]
method: RPBEPBE
basis: SDD
operation: Freq
keyword: #pfreq=noraman
keyword: PBEPBE/SDD
title: #p freq=noraman PBEPBE/SDD
converged: NO YES NO NO
title: Mulliken charges:
elementType: O O C C C C C C C C C C C C H H H H H H H H H H H H H H H H H H H H H H
charge: -0.267591 -0.268202 0.362942 -0.476889 -0.508899 0.007990 -0.404968 -0.414579 0.289189 -0.381902 -0.376704 -0.745282 -0.730810 -0.703346 0.225187 0.198938 0.226210 0.213825 0.189996 0.190129 0.207905 0.217762 0.193528 0.183887 0.222051 0.222889 0.183745 0.211270 0.213547 0.210674 0.217956 0.218517 0.208572 0.202708 0.201954 0.257801
chargesum: 0.00000
title: Mulliken charges with hydrogens summed into heavy atoms:
elementType: O O C C C C C C C C C C C C
charge: -0.267591 -0.268202 0.362942 -0.052764 -0.068863 0.197985 -0.006934 -0.003289 0.289189 0.024035 0.029929 -0.109790 -0.085765 -0.040882
polarizability: 1.59532862e+02 -2.02624390e+00 1.19720580e+02 9.09978287e-01 -4.33255708e-01 1.14013126e+02
1716.lowfreq: -20.5828 -14.4959 -0.0005 -0.0005 -0.0001 19.4435 62.0339 69.3751 136.8056
frequency: 61.9969 69.2682 136.7924 175.1970 179.9734 186.1589 212.6392 220.1515 237.5743 250.2891 281.1700 295.1995 299.0138 344.9553 387.4756 403.1271 407.2652 431.3116 457.8838 470.5866 473.1591 503.0868 576.3551 635.4170 674.0595 765.4067 769.8862 773.1854 837.5670 894.8847 896.5118 909.4579 917.3459 931.6977 938.0364 938.9869 955.4512 966.9209 971.2075 1008.9068 1018.3025 1025.8865 1041.8096 1051.9844 1088.1524 1093.5610 1146.8192 1153.1920 1176.3437 1192.5659 1207.0214 1209.4367 1248.8260 1257.8018 1274.0348 1274.9237 1300.2621 1304.0350 1307.9405 1323.5085 1331.8979 1341.4960 1346.9057 1356.5928 1365.8584 1373.2798 1386.2266 1394.9841 1446.6567 1452.4840 1453.3368 1457.2081 1465.5911 1467.3372 1469.9628 1475.5849 1478.2926 1478.3481 1478.8585 1487.1518 2935.8320 2940.1670 2946.9269 2965.1518 2966.2985 2973.6857 2976.3858 2982.6235 2993.6242 3005.3093 3030.8891 3041.0167 3050.4920 3055.7692 3057.4321 3060.8620 3063.3911 3063.9795 3064.3284 3069.5394 3074.3745 3097.6757
redmass: 3.3576 3.3518 2.2870 1.1557 2.3738 2.4018 1.1790 1.0892 2.2316 3.9483 2.2288 2.4694 2.4351 2.4619 2.1423 1.9211 1.9068 2.0035 3.4486 3.9063 3.9047 4.3394 2.8346 4.5458 4.1669 2.6441 2.6742 1.7175 2.2397 1.9500 1.8324 2.3716 2.1157 1.4449 1.4286 1.3896 3.2659 1.7085 3.1567 1.8553 1.4620 1.9847 2.3940 2.6876 1.3178 2.5269 1.6966 2.3403 1.9007 2.2736 1.4673 1.5696 1.4163 1.3494 2.1077 1.7865 1.3850 1.3275 1.6374 1.4870 1.2834 1.4622 1.6773 1.3386 1.5641 1.2238 1.2217 1.2097 1.0845 1.0872 1.0808 1.0654 1.0568 1.0724 1.0857 1.0526 1.0631 1.0615 1.0694 1.0609 1.0670 1.0825 1.0659 1.0364 1.0358 1.0587 1.0372 1.0597 1.0619 1.0634 1.1002 1.1003 1.1010 1.0965 1.0982 1.0990 1.0993 1.0991 1.0983 1.0983 1.1015 1.0981
irintensity: 0.2746 0.5668 0.0206 0.0722 0.4750 1.3220 0.2854 0.0842 1.1792 5.5804 1.2964 4.6374 2.2235 0.7197 1.1063 1.1817 1.0178 1.9289 2.5496 11.3800 2.2713 2.1374 7.0962 2.4349 2.8743 5.8330 3.9294 0.3162 28.8070 14.5811 4.4088 9.6549 4.5786 6.8681 7.6306 5.7666 13.1963 8.3097 12.2222 27.9992 0.2541 28.8917 58.2211 168.3038 3.7409 8.9549 10.9212 10.0306 5.3012 2.3407 0.6747 0.4837 22.3596 3.8316 0.7573 5.4797 0.5239 9.8704 0.6311 8.8065 1.6471 0.0797 3.3401 2.9560 22.7322 23.6571 8.6347 21.8659 7.3599 9.4946 10.9701 2.7215 1.8402 2.1423 8.2973 11.0637 10.1921 16.8437 10.8296 21.9574 39.9724 22.4187 70.4140 32.2223 43.4644 44.4878 32.8992 56.5405 26.1563 13.0485 40.1467 20.8875 37.9970 9.1582 4.0374 80.0317 11.2046 28.3336 67.6489 83.1429 43.0790 19.2804
temp: 298.150 k
press: 1.00000 atm
elementType: 8 8 6 6 6 6 6 6 6 6 6 6 6 6 1 1 1 1 1 1 1 1 1 1 1 1 1 1 1 1 1 1 1 1 1 1
symmnumber: 1
zpe: 840171.9 jmol-1
zpe.correction: 0.320005 hartree
zpe.thermalcorrener: 0.334594 hartree
zpe.thermalcorrenthalpy: 0.335538 hartree
zpe.thermalcorrgfe: 0.280309 hartree
zpe.sumelectzpe: -619.776012 hartree
zpe.sumelectthermal: -619.761422 hartree
zpe.sumelectthermalent: -619.760478 hartree
zpe.sumelectthermalfe: -619.815707 hartree
dipole: 0.8419 -1.8744 0.3208
dipole: 2.0797
quadrupole: -81.3698 -87.9890 -89.0304
quadrupole: -3.0025 -1.5851 -1.1122
quadrupole: 4.7599 -1.8593 -2.9006 -3.0025 -1.5851 -1.1122
hfenergy: -620.0960162 hartree
pointgroup: C01 [X(C12H22O2)]
dipole: 0.3316944 0.7227909 -0.1923752 debye
polarizability: 159.5322319|1.8833794|119.5930983|-1.1983491|-0.9371281|114.141238 unknown
InChI: InChI=1S/C12H22O2/c1-10-4-6-12(7-5-10)13-8-11(2,3)9-14-12/h10H,4-9H2,1-3H3
charge 0 multiplicity 1
36 atoms
O  0.903983 -1.030503 -1.101534
O  0.286764 -0.003448 1.007056
C  -0.195606 -0.417484 -0.327523
C  -0.841833 0.762415 -1.094274
C  -1.202971 -1.545906 -0.076687
C  -3.145718 0.132279 -0.152237
C  -2.11602 1.269028 -0.376949
C  -2.479339 -1.030695 0.62613
C  2.647798 0.221685 0.1974
C  2.101194 -0.175687 -1.200901
C  1.467776 0.876944 0.964059
C  -4.40614 0.648072 0.573686
C  3.785158 1.25488 0.027435
C  3.149926 -1.030896 0.953351
H  -1.097245 0.390797 -2.105664
H  -0.125872 1.594193 -1.228688
H  -0.701481 -2.322516 0.527145
H  -1.453064 -1.991853 -1.057905
H  -3.447419 -0.254036 -1.151445
H  -2.574015 2.086089 -0.968793
H  -1.835469 1.694599 0.60767
H  -2.214785 -0.679157 1.642698
H  -3.197577 -1.865297 0.745424
H  1.882098 0.737522 -1.796845
H  2.834281 -0.787498 -1.754545
H  1.726106 1.047451 2.02358
H  1.210621 1.855469 0.501362
H  -4.893853 1.464695 0.008387
H  -5.149189 -0.159777 0.711992
H  -4.145464 1.040107 1.575972
H  4.176132 1.575207 1.011488
H  4.628536 0.820601 -0.54161
H  3.439789 2.158057 -0.512109
H  3.978135 -1.516005 0.402927
H  3.520729 -0.759781 1.959937
H  2.333937 -1.76375 1.068808
