program: Gaussian 09
title: 000236071
version: EM64L-G09RevD.01
frameworkgroup: C1[X(C10H11NO4)]
method: RPBEPBE
basis: SDD
operation: Freq
keyword: #p
keyword: freq=noraman
keyword: PBEPBE/SDD
title: #p freq=noraman PBEPBE/SDD
converged: YES YES NO YES
title: Mulliken charges:
elementType: O O O O N C C C C C C C C C C H H H H H H H H H H H
charge: -0.250264 -0.256166 -0.218315 -0.210448 0.015520 0.403422 -0.440639 -0.371357 0.235029 -0.481131 0.149137 0.226386 -0.517869 -0.701897 -0.202522 0.240630 0.240661 0.201518 0.201516 0.283625 0.310265 0.247530 0.247531 0.213867 0.213867 0.220104
chargesum: 0.00000
title: Mulliken charges with hydrogens summed into heavy atoms:
elementType: O O O O N C C C C C C C C C C
charge: -0.250264 -0.256166 -0.218315 -0.210448 0.015520 0.403422 0.040652 0.031677 0.235029 -0.197506 0.149137 0.226386 -0.207604 -0.054060 0.292539
polarizability: 1.91849038e+02 -1.63082010e+01 1.57487217e+02 4.54957907e-03 3.77765710e-03 6.78240299e+01
1716.lowfreq: -8.3281 -6.9009 -0.0006 0.0002 0.0007 4.3434 13.9862 20.2954 69.0277
frequency: 12.4314 18.9173 69.0106 112.0715 119.9802 122.3696 171.0191 208.6945 229.1779 260.5636 301.4079 325.5108 342.4886 345.8352 395.0748 424.3764 522.8094 575.5525 582.0485 665.5249 684.3157 696.2903 704.2433 741.6493 752.0203 762.0434 823.8905 836.5464 847.8684 899.5507 912.2742 912.3543 973.2850 983.6780 1054.8680 1062.0170 1091.9119 1095.1679 1097.4741 1120.0460 1148.8683 1195.6181 1237.4959 1240.9821 1255.2720 1279.4276 1291.4840 1332.0706 1348.7008 1365.5038 1386.2406 1395.9107 1424.4116 1435.6222 1470.1360 1476.2863 1477.1860 1484.1531 1490.3183 1612.8717 1624.1984 2967.4577 2979.0636 2990.1593 3011.3301 3025.2500 3038.2384 3075.4527 3080.4086 3107.8694 3202.4711 3206.8112
redmass: 5.1402 2.7294 4.7738 3.5473 1.8709 3.7837 3.6898 7.9716 1.1891 5.5086 4.5788 3.9949 9.5925 6.6688 9.2234 3.1866 5.0021 6.3351 4.8066 7.5328 10.2150 7.5099 3.6659 6.8286 1.3206 8.5619 5.0937 9.0994 1.2910 1.3299 1.9803 1.3617 6.8620 4.3699 2.7627 1.4562 2.2527 3.5595 1.5069 1.0370 2.1594 12.4194 1.3651 1.2801 4.1078 1.6213 1.0764 3.4641 2.2233 1.4104 2.0934 1.4077 2.0557 2.0697 1.5087 1.0414 1.1179 1.1382 1.6067 10.1936 8.0795 1.0592 1.0362 1.0618 1.0986 1.0535 1.1000 1.1006 1.0995 1.1193 1.0916 1.0929
irintensity: 2.5257 10.5894 0.0176 3.1093 1.7018 0.7884 0.0241 1.8364 0.1038 0.7849 0.0446 3.6641 0.6079 0.0016 1.6337 4.5373 5.7227 3.0745 5.4204 9.0761 2.2048 2.9456 0.9788 2.0383 8.9725 15.3702 1.8630 41.1758 11.0333 0.0538 6.8670 41.8571 112.3249 83.8693 0.7853 4.3524 2.1020 8.4484 2.4292 0.0128 14.0537 497.9197 3.0267 0.0021 157.8774 12.5928 0.0901 62.2370 17.9593 11.9468 15.5849 35.7669 43.1845 34.5407 153.4168 13.3378 22.7769 34.3448 93.3608 17.2374 27.0789 25.9182 34.3761 12.5155 4.7526 105.1986 14.7997 59.9211 41.7362 24.0887 0.5219 12.5819
temp: 298.150 k
press: 1.00000 atm
elementType: 8 8 8 8 7 6 6 6 6 6 6 6 6 6 6 1 1 1 1 1 1 1 1 1 1 1
symmnumber: 1
zpe: 517466.4 jmol-1
zpe.correction: 0.197093 hartree
zpe.thermalcorrener: 0.211024 hartree
zpe.thermalcorrenthalpy: 0.211969 hartree
zpe.thermalcorrgfe: 0.153559 hartree
zpe.sumelectzpe: -742.088976 hartree
zpe.sumelectthermal: -742.075044 hartree
zpe.sumelectthermalent: -742.074100 hartree
zpe.sumelectthermalfe: -742.132510 hartree
dipole: 2.7960 -5.1629 0.0001
dipole: 5.8714
quadrupole: -77.6753 -101.5655 -86.3417
quadrupole: 3.7787 -0.0013 -0.0003
quadrupole: 10.8522 -13.0380 2.1858 3.7787 -0.0013 -0.0003
hfenergy: -742.2860687 hartree
pointgroup: C01 [X(C10H11N1O4)]
dipole: 1.2477948 -1.9439595 -0.0035008 debye
dipolederiv: -1.4507663 0.4104052 0.0021094 0.4986935 -0.6318389 -0.0010742 0.002192 -0.0009502 -0.246415 -1.4328552 0.2296595 0.0019045 0.0871868 -0.36892 -0.0002411 0.0017741 -0.0004379 -0.2493258 -0.4218803 -0.1389141 0.0000566 0.040658 -1.0897673 -0.0009618 0.0002345 -0.000659 -0.2438845 -1.0187866 0.1644766 0.0011798 -0.0017857 -0.4779596 -0.0002621 0.0009469 -0.0005089 -0.2115368 1.4189715 -0.3852153 -0.001895 -0.4303462 1.765453 0.0022522 -0.0018995 0.0021411 0.174606 0.3611589 0.16351 -0.0004018 -0.2715612 0.2484921 0.0006269 -0.0008255 0.0000292 -0.0052767 -0.1246922 -0.1444056 0.0002013 0.1102205 0.1778391 -0.0001029 0.0004205 0.0002999 0.1051084 0.0197809 -0.0499749 0.0002042 -0.001745 0.0722229 -0.0000941 0.00026 -0.0000059 0.1782296 -0.3987374 0.4673788 0.0009922 0.4190775 -0.6203645 -0.0011974 0.0009591 -0.0012459 0.0129437 -0.5473862 0.1392469 0.0007087 0.1031442 0.0523128 0.0000484 0.0006783 0.0000001 -0.1526145 0.9822934 -0.3785027 -0.0016613 -0.950112 0.6267127 0.0018756 -0.0022106 0.0010682 0.075253 1.219604 -0.0723543 -0.0017335 0.5114138 -0.4630051 -0.0012051 -0.0011675 -0.0004024 0.0469424 0.0100792 -0.3646291 -0.0005269 0.0489584 0.0118866 0.0000725 -0.0001095 0.0006019 -0.1254697 -0.0090976 -0.0246088 0.000136 -0.0706035 0.0408823 0.0000664 0.0000903 -0.0000122 0.0906131 1.218848 -0.217999 -0.0011523 -0.132836 0.5288695 0.0001627 -0.0010756 0.0002867 0.5575905 0.0200462 0.00398 0.0580773 -0.0134428 -0.0126201 -0.0512595 0.0489606 -0.057999 -0.0124864 0.019741 0.0042267 -0.0581617 -0.0132018 -0.0127606 0.0512814 -0.0490669 0.0579698 -0.0119515 -0.014734 0.0578239 0.1010342 0.0192818 0.0040295 -0.0658254 0.1027792 -0.0721191 -0.0785807 -0.0153888 0.0582444 -0.101133 0.0196767 0.0037936 0.0659064 -0.102949 0.0720705 -0.0776744 0.1525703 -0.0024664 -0.0000112 -0.0141932 -0.0168056 -0.0001419 -0.0000167 -0.0001576 0.1532409 0.125101 0.0024418 0.0000951 -0.0586022 0.10567 0.0000069 0.0000179 -0.0000787 0.1887598 -0.0846758 0.0535572 -0.0542087 0.0341028 0.0635655 0.0199649 -0.1497868 0.0483866 -0.0546189 -0.0840932 0.0533146 0.054393 0.0337557 0.0637012 -0.0198329 0.1499393 -0.0483121 -0.0553366 0.0150537 0.0145444 0.0637083 0.0762374 0.0592053 -0.1002801 0.1042985 -0.0728381 -0.080513 0.0145186 0.0149136 -0.0639828 0.0767845 0.0588615 0.1003151 -0.1044505 0.073067 -0.0796125 0.0253269 -0.0586535 0.0000674 -0.120762 -0.1894559 -0.0001008 0.0000072 -0.0001939 0.1020099 unknown
polarizability: 194.0740401|-13.5844336|155.2618507|-0.1909092|0.1015235|67.8243945 unknown
InChI: InChI=1S/C10H11NO4/c1-2-3-7-4-9-10(15-6-14-9)5-8(7)11(12)13/h4-5H,2-3,6H2,1H3
charge 0 multiplicity 1
26 atoms
O  2.705288 -1.788606 -0.00471
O  3.395349 0.514412 -0.003475
O  -0.776459 3.396377 0.005312
O  -2.544571 1.96915 0.005926
N  -1.269363 2.197291 0.004696
C  -0.768995 -0.308181 0.001649
C  -2.235636 -0.734002 0.003417
C  -2.505984 -2.253743 0.002534
C  -0.324872 1.05717 0.002292
C  0.241494 -1.316004 -0.000748
C  1.583932 -0.940235 -0.002296
C  1.984783 0.41365 -0.001563
C  1.052162 1.437631 0.000723
C  -4.021533 -2.548463 0.004716
C  3.896263 -0.88445 -0.005539
H  -2.740577 -0.273068 0.874372
H  -2.7431 -0.2716 -0.865286
H  -2.04597 -2.725478 -0.889105
H  -2.043091 -2.727064 0.89184
H  -0.027878 -2.372476 -0.00137
H  1.321037 2.494578 0.001356
H  4.476583 -1.064476 0.914675
H  4.473942 -1.062698 -0.927757
H  -4.509442 -2.116463 0.898091
H  -4.512355 -2.114658 -0.886186
H  -4.217707 -3.635695 0.003937
