program: Gaussian 09
title: 000236070
version: EM64L-G09RevD.01
frameworkgroup: C1[X(C16H17NO4S)]
method: RPBEPBE
basis: SDD
operation: Freq
keyword: #p
keyword: freq=noraman
keyword: PBEPBE/SDD
title: #p freq=noraman PBEPBE/SDD
converged: YES YES NO NO
title: Mulliken charges:
elementType: S O O O O N C C C C C C C C C C C C C C C C H H H H H H H H H H H H H H H H H
charge: 0.880253 -0.257879 -0.253511 -0.518004 -0.527393 -0.524929 0.649313 -0.345689 -0.555728 -0.514956 -0.345442 0.180263 0.201787 -0.354364 -0.204407 -0.693329 0.332436 -0.301298 -0.343493 -0.207434 -0.196251 -0.233389 0.263280 0.203640 0.271495 0.326721 0.197957 0.251860 0.289564 0.241656 0.246403 0.226390 0.201801 0.222450 0.256039 0.235041 0.232835 0.232327 0.233985
chargesum: 0.00000
title: Mulliken charges with hydrogens summed into heavy atoms:
elementType: S O O O O N C C C C C C C C C C C C C C C C
charge: 0.880253 -0.257879 -0.253511 -0.518004 -0.527393 -0.235366 0.649313 -0.345689 -0.088808 -0.243462 -0.018721 0.180263 0.201787 0.095454 0.283652 -0.042688 0.332436 -0.045259 -0.108451 0.025401 0.036075 0.000596
polarizability: 2.82627397e+02 -6.77387351e+00 2.58415570e+02 6.24576233e+00 1.16151646e+01 1.65018523e+02
1716.lowfreq: -9.0239 -5.2282 0.0008 0.0014 0.0015 2.8684 6.7581 23.7522 36.5030
frequency: 3.6978 23.7044 36.4444 48.8110 65.3058 74.0208 80.1515 93.1374 102.7101 135.2058 154.5776 170.2204 182.0907 199.7280 228.8534 232.1976 262.2476 274.4098 293.7828 310.3461 334.3780 360.4235 384.5291 394.8762 405.6686 424.5939 455.0109 489.1939 508.2861 532.3480 563.1488 611.6343 647.1494 666.6070 679.5117 688.9089 719.7657 745.2858 751.2150 772.9333 790.6477 802.0346 815.1234 832.7907 837.8798 870.0512 872.7268 891.9143 896.2187 900.2453 920.3717 933.1101 936.6549 973.4721 975.3233 986.2836 996.4370 1020.1920 1050.1038 1064.8324 1070.1823 1078.0411 1081.7642 1092.1097 1124.7972 1158.8504 1171.4433 1176.5843 1207.6428 1211.5111 1229.9486 1237.7668 1251.2300 1276.6841 1289.3361 1327.1256 1336.7316 1359.6205 1378.4210 1386.7530 1390.0568 1425.1682 1444.4867 1460.7800 1468.7989 1471.6626 1475.3209 1480.4072 1486.2093 1491.3634 1582.4819 1599.2063 1601.8900 1619.1066 2973.5326 2982.3045 2990.3034 3013.3018 3043.6366 3064.4023 3075.7142 3081.1187 3114.6555 3127.3690 3134.6620 3147.4501 3160.0728 3168.1797 3171.7925 3172.2553 3328.2650
redmass: 5.1838 5.2308 4.4433 3.3103 4.4911 5.4835 3.4158 1.9927 2.8754 6.6962 6.1681 10.7855 7.7881 6.6746 5.0432 1.4151 3.8024 6.1149 3.4330 3.5621 6.2699 7.3592 9.0020 3.6319 3.3413 3.9205 4.6489 4.7787 3.9813 5.1945 5.1006 6.3581 8.0406 8.5998 9.5820 1.7799 4.3035 1.1169 4.9203 1.8405 6.0131 10.8567 5.2334 8.6176 1.2829 1.7246 1.3151 1.5920 1.3478 1.3961 1.8037 3.1580 5.6579 4.9957 1.4304 5.6779 1.3313 2.1245 3.0045 3.5520 1.4930 1.5440 1.5278 2.1591 1.0541 1.9649 1.0872 1.1651 1.6939 1.4548 1.7822 1.3589 4.3219 1.3587 1.1260 1.2761 1.3888 1.4015 2.9576 1.2140 7.1043 6.8004 2.2352 3.0256 1.0712 2.2167 1.0544 1.0532 1.2201 1.0933 5.8903 6.0160 8.5262 9.0176 1.0358 1.0621 1.0655 1.0586 1.0951 1.0985 1.0995 1.1019 1.1133 1.0867 1.0876 1.0925 1.0961 1.0928 1.0998 1.0948 1.0744
irintensity: 0.6003 0.5083 0.3682 0.4283 0.0852 2.9259 3.8389 4.2896 2.8521 2.4841 2.8576 3.7931 12.8624 0.1897 2.6172 0.2407 0.4210 6.3720 0.3463 1.1684 20.6216 6.3108 45.0191 3.7738 9.1166 71.2879 27.2352 61.7452 2.9486 1.2305 3.2979 0.2878 3.7159 0.6755 0.3411 41.4627 2.9638 9.2401 1.9871 49.0000 20.4567 68.4387 15.0886 24.9915 2.5620 16.3506 8.7894 3.3833 64.6686 39.2189 18.7533 15.8022 61.3010 162.5734 2.5121 0.4104 0.1270 4.0859 0.5738 5.0168 5.7662 10.9965 3.9635 30.6501 0.2479 14.0757 1.6347 6.2289 13.6885 13.2800 7.3272 35.0012 207.9026 7.7286 5.5821 2.2788 1.3345 1.2573 5.6081 10.3601 1.2274 3.0014 10.3973 246.5006 7.3265 16.2390 12.2870 6.2675 24.3989 11.0154 1.2686 0.2189 11.5639 2.0164 44.4274 23.2867 31.0689 122.7425 1.3284 5.3146 38.2064 55.3604 22.9279 3.5824 0.3814 14.8910 27.1902 0.0770 22.7945 18.3571 13.4408
temp: 298.150 k
press: 1.00000 atm
elementType: 16 8 8 8 8 7 6 6 6 6 6 6 6 6 6 6 6 6 6 6 6 6 1 1 1 1 1 1 1 1 1 1 1 1 1 1 1 1 1
symmnumber: 1
zpe: 781556.4 jmol-1
zpe.correction: 0.297679 hartree
zpe.thermalcorrener: 0.319269 hartree
zpe.thermalcorrenthalpy: 0.320213 hartree
zpe.thermalcorrgfe: 0.243269 hartree
zpe.sumelectzpe: -1371.802734 hartree
zpe.sumelectthermal: -1371.781144 hartree
zpe.sumelectthermalent: -1371.780200 hartree
zpe.sumelectthermalfe: -1371.857144 hartree
dipole: -0.8473 -3.3262 -3.6507
dipole: 5.0109
quadrupole: -113.7288 -129.5967 -148.5106
quadrupole: 4.7726 -2.6925 -2.5810
quadrupole: 16.8833 1.0153 -17.8986 4.7726 -2.6925 -2.5810
hfenergy: -1372.100413 hartree
pointgroup: C01 [X(C16H17N1O4S1)]
dipole: 0.2441643 1.5780769 -1.1560948 debye
polarizability: 283.9984593|-2.58803|258.408859|5.6162493|4.3673541|163.6541707 unknown
InChI: InChI=1S/C16H17NO4S/c1-2-6-12-9-14-15(21-11-20-14)10-16(12)22(18,19)17-13-7-4-3-5-8-13/h3-5,7-10,17H,2,6,11H2,1H3
charge 0 multiplicity 1
39 atoms
S  -0.617556 -1.626408 0.974174
O  3.3358 2.8179 0.087987
O  1.648604 3.094924 1.773442
O  -1.483256 -1.053871 2.235059
O  0.023458 -3.123546 1.050511
N  -1.709157 -1.684992 -0.719812
C  1.646979 -0.521458 -0.437691
C  0.675369 -0.310077 0.57083
C  1.769341 -1.788618 -1.269473
C  2.59473 0.52941 -0.643111
C  0.570673 0.847232 1.385551
C  2.515903 1.671797 0.152917
C  1.524856 1.830847 1.148172
C  2.786766 -2.79952 -0.665907
C  2.906144 3.674451 1.232335
C  2.921378 -4.061925 -1.541734
C  -2.69252 -0.654305 -0.802169
C  -2.291222 0.610109 -1.3189
C  -4.049324 -0.857558 -0.41971
C  -3.23484 1.646257 -1.458381
C  -4.993191 0.176216 -0.587181
C  -4.588566 1.432361 -1.099154
H  0.789074 -2.284874 -1.375432
H  2.104677 -1.513742 -2.288905
H  3.36511 0.427942 -1.412375
H  -0.212525 0.933184 2.143584
H  3.773243 -2.30663 -0.554645
H  2.441102 -3.083165 0.344546
H  -2.134559 -2.626443 -0.585058
H  3.687501 3.642351 2.013332
H  2.703477 4.690415 0.860739
H  1.951912 -4.587529 -1.620373
H  3.257671 -3.81066 -2.566077
H  3.652686 -4.768245 -1.108604
H  -1.248956 0.74654 -1.625273
H  -4.353848 -1.821415 0.006338
H  -2.921625 2.61613 -1.859727
H  -6.037988 0.010724 -0.303091
H  -5.321418 2.237988 -1.216829
