program: Gaussian 09
title: 000236066
version: EM64L-G09RevD.01
frameworkgroup: C1[X(C12H18O4)]
method: RPBEPBE
basis: SDD
operation: Freq
keyword: #pfreq=noraman
keyword: PBEPBE/SDD
title: #p freq=noraman PBEPBE/SDD
converged: YES YES NO NO
title: Mulliken charges:
elementType: O O O O C C C C C C C C C C C C H H H H H H H H H H H H H H H H H H
charge: -0.418507 -0.418507 -0.231283 -0.231282 -0.433142 -0.433146 -0.108670 -0.108665 -0.515152 -0.515152 0.163865 0.163864 -0.045126 -0.045125 -0.580690 -0.580691 0.207675 0.242136 0.207676 0.242137 0.238457 0.238455 0.211711 0.235761 0.211710 0.235763 0.217393 0.217392 0.373933 0.373933 0.215748 0.225891 0.215748 0.225891
chargesum: 0.00000
title: Mulliken charges with hydrogens summed into heavy atoms:
elementType: O O O O C C C C C C C C C C C C
charge: -0.044574 -0.044574 -0.231283 -0.231282 0.016669 0.016667 0.129787 0.129790 -0.067680 -0.067679 0.163865 0.163864 0.172267 0.172267 -0.139052 -0.139052
polarizability: 1.76150645e+02 -1.10680395e+00 1.20700708e+02 1.91873021e-03 4.81187458e-05 1.22557376e+02
1716.lowfreq: -0.0009 -0.0006 0.0002 3.4847 9.0378 11.8528 24.6388 34.6474 36.5543
frequency: 24.6365 34.5737 36.5499 44.9140 51.2961 61.7994 66.6360 78.6654 81.9321 109.8031 159.4974 164.6289 194.2363 246.2786 247.4694 265.0142 301.4989 368.6333 374.2174 405.9427 437.7285 474.6577 493.7902 584.8335 585.0578 609.6686 611.9890 642.2363 657.6618 718.9179 724.0248 749.3120 765.9454 823.8321 904.4046 912.3859 931.7626 941.2951 952.0531 953.2265 1002.4268 1003.4055 1007.0398 1024.9286 1027.5510 1036.8486 1053.5352 1056.4176 1073.1421 1076.8171 1120.1747 1121.1452 1171.4319 1217.1367 1217.6388 1233.2422 1245.4228 1251.8588 1269.3792 1281.7407 1290.2418 1294.2702 1311.8697 1319.0966 1322.4459 1353.4147 1374.0725 1376.4628 1425.3252 1425.4373 1449.6023 1456.3025 1461.6823 1468.4431 1659.3099 1659.4470 1659.9018 1665.4436 2973.3799 2974.0806 2976.4376 2982.1461 3017.1972 3019.9870 3031.9254 3048.7451 3052.7676 3059.7702 3078.1225 3078.2472 3095.3754 3095.4104 3198.6096 3198.6399 3497.9651 3498.0647
redmass: 5.5256 4.6276 6.3219 6.7802 4.5670 3.7681 3.9593 3.4356 3.4074 2.1502 3.1701 3.1436 2.3608 3.7527 3.4800 4.1521 2.7370 3.4541 2.5055 2.3567 2.0919 3.5707 2.9777 3.2374 3.5919 1.3795 1.3963 1.4300 1.4287 1.8055 3.9667 2.8891 2.9582 2.0400 1.4852 2.0996 2.1007 1.6755 1.3391 1.3834 1.1551 1.1604 4.7154 3.1600 1.7334 3.8076 2.1161 1.7562 3.1582 2.2566 2.0993 1.8596 1.3935 1.4177 1.4131 1.2210 1.4287 1.4873 1.2547 1.2365 1.2485 1.2313 1.2528 1.2861 1.2831 1.4653 1.7071 1.7153 1.1684 1.1694 1.0853 1.1079 1.1030 1.1029 5.1662 4.7473 7.1250 7.8969 1.0617 1.0628 1.0610 1.0598 1.0893 1.0862 1.0958 1.0992 1.0957 1.0997 1.0777 1.0779 1.0767 1.0768 1.1150 1.1150 1.0637 1.0637
irintensity: 0.0761 0.0099 3.5220 0.1078 1.2208 0.4516 0.0397 0.0002 0.1784 0.1016 0.0856 0.0229 0.1675 0.4174 0.0335 4.9971 3.9564 4.0845 0.3623 7.5841 1.3530 1.5284 27.2218 6.1120 25.6122 129.1579 0.4053 147.8580 16.0867 3.6137 86.7528 5.0169 0.0028 1.4514 8.9388 0.0700 2.2162 0.1551 105.8987 41.6486 35.3488 10.4979 93.7799 2.0953 12.0169 0.0038 395.3152 0.3725 10.5428 0.5945 0.9357 33.7647 9.4267 3.9554 0.0074 6.9457 2.0028 0.9698 1.3063 4.8962 2.7872 0.3317 5.5383 1.0307 0.5690 7.1265 41.4405 4.0545 3.6177 5.3440 0.0004 9.6202 6.7215 43.0733 30.5685 0.4077 83.9050 228.6461 1.2692 23.5519 13.7741 61.7230 5.3845 1.5614 4.0276 0.1705 3.3903 45.6188 13.1422 52.3891 14.1510 1.4340 35.5616 17.0327 33.8302 5.3708
temp: 298.150 k
press: 1.00000 atm
elementType: 8 8 8 8 6 6 6 6 6 6 6 6 6 6 6 6 1 1 1 1 1 1 1 1 1 1 1 1 1 1 1 1 1 1
symmnumber: 1
zpe: 730523.1 jmol-1
zpe.correction: 0.278242 hartree
zpe.thermalcorrener: 0.296929 hartree
zpe.thermalcorrenthalpy: 0.297873 hartree
zpe.thermalcorrgfe: 0.227893 hartree
zpe.sumelectzpe: -767.695385 hartree
zpe.sumelectthermal: -767.676698 hartree
zpe.sumelectthermalent: -767.675754 hartree
zpe.sumelectthermalfe: -767.745733 hartree
dipole: 0.0000 -0.0003 -2.7735
dipole: 2.7735
quadrupole: -95.3716 -90.1963 -100.2633
quadrupole: 5.3356 -0.0004 -0.0009
quadrupole: -0.0946 5.0808 -4.9862 5.3356 -0.0004 -0.0009
hfenergy: -767.9736269 hartree
pointgroup: C01 [X(C12H18O4)]
dipole: 0.00001 -0.0001031 -1.0911937 debye
polarizability: 176.1582772|-0.8953915|120.6930753|0.0019185|0.0000554|122.5573756 unknown
InChI: InChI=1S/C12H18O4/c1-3-5-9(11(13)14)7-8-10(6-4-2)12(15)16/h3-4,9-10,13,15H,1-2,5-8H2
charge 0 multiplicity 1
34 atoms
O  -2.393431 -2.278423 0.425136
O  2.393468 2.278451 0.424845
O  -2.384068 -0.448827 1.852766
O  2.384053 0.449123 1.85282
C  -0.565483 0.525799 -0.481382
C  0.565481 -0.52593 -0.481219
C  -1.988147 -0.097764 -0.564377
C  1.98815 0.097614 -0.564261
C  -3.076593 1.010714 -0.714401
C  3.076602 -1.010893 -0.714024
C  -2.271564 -0.906962 0.694644
C  2.2715 0.907051 0.694621
C  -4.46228 0.453953 -0.968115
C  4.462298 -0.454182 -0.967794
C  -5.535651 0.647864 -0.161785
C  5.53564 -0.647937 -0.161387
H  -0.43958 1.202302 -1.350316
H  -0.507785 1.154402 0.428231
H  0.439641 -1.202636 -1.350004
H  0.50772 -1.154321 0.428537
H  -2.036818 -0.785848 -1.428851
H  2.036864 0.785533 -1.428865
H  -2.773078 1.656358 -1.56398
H  -3.077111 1.63667 0.197022
H  2.773118 -1.656703 -1.563488
H  3.077085 -1.636671 0.197521
H  -4.578065 -0.15299 -1.880231
H  4.578118 0.152584 -1.880024
H  -2.584654 -2.761862 1.275641
H  2.58472 2.762043 1.275257
H  -6.516732 0.219935 -0.397129
H  -5.458921 1.237167 0.76018
H  6.516729 -0.220055 -0.396779
H  5.458875 -1.23706 0.76069
