program: Gaussian 09
title: 000236065
version: EM64L-G09RevD.01
frameworkgroup: C1[X(C14H11N3O5S)]
method: RPBEPBE
basis: SDD
operation: Freq
keyword: #p
keyword: freq=noraman
keyword: PBEPBE/SDD
title: #p freq=noraman PBEPBE/SDD
converged: YES YES NO NO
title: Mulliken charges:
elementType: S O O O O O N N N C C C C C C C C C C C C C C H H H H H H H H H H H
charge: 0.932158 -0.303546 -0.489440 -0.547748 -0.222755 -0.170249 -0.105464 -0.021310 0.075799 -0.055123 0.197748 0.122484 0.431977 0.170663 -0.182539 -0.292541 -0.596208 -0.350506 -0.405787 -0.396233 -0.216112 -0.229744 -0.227376 0.273779 0.301302 0.304144 0.264907 0.222112 0.295886 0.248877 0.245544 0.244904 0.241973 0.238424
chargesum: 0.00000
title: Mulliken charges with hydrogens summed into heavy atoms:
elementType: S O O O O O N N N C C C C C C C C C C C C C C
charge: 0.932158 -0.303546 -0.489440 -0.547748 -0.222755 -0.170249 -0.105464 -0.021310 0.075799 -0.055123 0.197748 0.122484 0.431977 0.170663 0.091240 0.008762 0.194955 -0.054620 -0.156910 -0.150689 0.028792 0.012228 0.011048
polarizability: 4.71984759e+02 -2.83790644e+01 2.74108311e+02 1.85561362e-01 2.86571582e+00 1.22893050e+02
1716.lowfreq: -9.7066 -5.2877 -0.4293 0.0013 0.0015 0.0023 6.8154 17.5800 27.7309
frequency: 5.4576 17.5337 27.6502 43.8950 48.3747 57.0530 88.1457 91.4878 110.5337 114.0801 137.4319 151.8340 172.9201 189.1947 224.0971 239.0335 267.7671 278.3178 291.8142 305.9955 362.4629 379.9405 387.2303 420.4581 450.3429 451.3307 467.0163 476.2975 523.2267 543.9411 546.9843 572.6135 610.7789 631.5029 656.1307 680.7472 705.0052 725.7073 749.2319 757.3032 775.7193 777.5757 781.7471 803.2652 828.7766 873.1776 876.9163 899.6168 938.5623 949.6966 979.0050 995.0707 1005.6142 1022.3119 1041.2276 1057.0724 1068.8669 1086.4789 1125.1913 1141.7649 1175.2085 1181.0368 1184.6464 1223.1858 1234.2810 1250.4263 1288.0445 1292.6929 1297.7873 1341.3488 1350.4755 1372.3334 1399.6145 1412.9727 1417.3048 1431.7747 1441.7660 1442.4796 1448.7062 1470.6516 1487.0526 1509.4054 1541.4168 1566.4454 1611.2760 3016.4948 3115.8339 3130.4427 3132.1026 3135.0970 3142.6268 3154.6637 3155.4464 3170.2740 3172.3386 3242.0843
redmass: 7.3940 5.9578 6.1810 5.0256 1.4135 8.3840 6.1209 4.5295 8.1543 8.5592 8.3718 8.7208 4.7407 4.6173 7.5767 7.2017 5.5399 5.6132 6.9759 5.9358 5.7302 10.0316 11.4860 3.4120 7.0267 4.5891 4.0397 7.3928 6.3633 3.8749 6.1998 5.8653 7.7688 4.0710 2.9218 7.1955 5.6787 12.8629 1.6830 11.9526 10.8913 1.9433 2.9162 1.4516 1.8142 9.9704 6.4429 1.6361 1.4355 8.2080 1.3994 1.4087 1.3824 2.8739 2.8301 2.4085 2.8298 2.2714 1.3291 1.4538 1.1341 2.8045 1.2402 2.5376 1.7490 2.3419 8.0209 2.1513 3.5956 7.5989 3.4141 12.6217 2.8632 2.2256 6.9685 2.1948 3.9610 2.6407 1.0995 1.7042 1.0881 3.5745 4.4096 6.4852 6.1042 1.0330 1.1024 1.0880 1.0879 1.1033 1.0893 1.0927 1.0940 1.1005 1.0988 1.0995
irintensity: 3.2110 1.9198 3.4457 0.8884 0.3061 6.3363 11.4511 1.2746 1.9556 0.1456 8.2124 3.6705 10.6177 18.5068 3.4717 11.1056 1.3094 16.7964 9.3512 23.0309 19.7439 35.1700 69.1004 7.4481 91.5561 17.4069 1.3932 16.3670 2.9883 7.5367 4.6910 7.4887 8.3945 15.1071 0.8768 4.0849 1.7843 0.4419 4.5440 24.1162 66.4205 74.1024 30.1504 24.4604 46.0998 35.7763 23.0422 6.8354 0.4606 27.6470 2.0804 0.8019 0.7733 1.9962 3.4136 1.6462 1.0719 6.1379 1.6380 5.1905 10.5365 24.2775 6.6467 100.2132 53.1854 135.8935 36.2231 44.1786 4.0213 58.5147 30.7591 167.7722 104.9950 0.2624 19.9194 16.3551 14.0004 10.1062 55.0216 44.7032 53.3528 75.8900 5.3042 111.3616 11.5848 26.8863 14.4146 0.3421 3.0728 7.0221 7.7278 8.4184 15.7224 32.8244 17.2895 0.3770
temp: 298.150 k
press: 1.00000 atm
elementType: 16 8 8 8 8 8 7 7 7 6 6 6 6 6 6 6 6 6 6 6 6 6 6 1 1 1 1 1 1 1 1 1 1 1
symmnumber: 1
zpe: 609666.4 jmol-1
zpe.correction: 0.232210 hartree
zpe.thermalcorrener: 0.253696 hartree
zpe.thermalcorrenthalpy: 0.254640 hartree
zpe.thermalcorrgfe: 0.176973 hartree
zpe.sumelectzpe: -1476.616301 hartree
zpe.sumelectthermal: -1476.594814 hartree
zpe.sumelectthermalent: -1476.593870 hartree
zpe.sumelectthermalfe: -1476.671538 hartree
dipole: -3.5330 -3.9917 -1.2884
dipole: 5.4842
quadrupole: -96.6392 -134.2414 -150.7003
quadrupole: -28.9112 -0.6847 7.3615
quadrupole: 30.5544 -7.0478 -23.5066 -28.9112 -0.6847 7.3615
hfenergy: -1476.8485104 hartree
pointgroup: C01 [X(C14H11N3O5S1)]
dipole: -1.460641 1.5514257 0.3391444 debye
polarizability: 467.2491425|37.6107|275.1829095|-20.1026614|-21.6128018|126.5540679 unknown
InChI: InChI=1S/C10H7O.C4H4N3O4S/c11-10-7-3-5-8-4-1-2-6-9(8)10;1-6-2-5-3(7(8)9)4(6)12(10)11/h1-7H;2H,1H3
charge 0 multiplicity 1
34 atoms
S  0.806129 0.993296 -0.923886
O  -0.316904 -0.011095 0.776877
O  0.624039 0.448098 -2.457204
O  0.594724 2.609303 -0.66739
O  1.525595 -1.987666 -0.457046
O  3.27663 -2.731557 0.81557
N  3.554927 1.686692 -0.273929
N  4.533366 -0.230662 0.479112
N  2.655471 -1.817414 0.162679
C  2.594373 0.678322 -0.379348
C  -2.711196 0.159417 0.392095
C  -1.467982 -0.615072 0.483123
C  -3.96016 -0.546763 0.220812
C  3.227778 -0.486032 0.092052
C  4.703142 1.083901 0.244434
C  -1.50835 -2.039248 0.31425
C  3.453751 3.105222 -0.677893
C  -2.709624 1.578758 0.458799
C  -3.948445 -1.976627 0.120834
C  -5.179594 0.201786 0.139833
C  -2.74251 -2.7065 0.166401
C  -3.919866 2.289247 0.368421
C  -5.15848 1.600106 0.211249
H  5.622915 1.637368 0.418011
H  -0.554288 -2.576172 0.314122
H  2.582202 3.571481 -0.19579
H  3.329239 3.18371 -1.770199
H  4.384445 3.610929 -0.376625
H  -1.756199 2.105521 0.572029
H  -4.900571 -2.50435 -0.013415
H  -6.127644 -0.334769 0.017045
H  -2.760818 -3.79663 0.06997
H  -3.911846 3.38329 0.416173
H  -6.091645 2.169007 0.144136
