program: Gaussian 09
title: 000020679
version: EM64L-G09RevD.01
frameworkgroup: C1[X(C4H8N2O)]
method: RPBEPBE
basis: SDD
operation: Freq
keyword: #pfreq=noraman
keyword: PBEPBE/SDD
title: #p freq=noraman PBEPBE/SDD
converged: YES YES NO NO
title: Mulliken charges:
elementType: O N N C C C C H H H H H H H H
charge: -0.291573 -0.061789 0.070882 -0.394423 -0.626232 -0.014382 -0.577406 0.238250 0.222329 0.236871 0.276452 0.240692 0.241280 0.223540 0.215510
chargesum: 0.00000
title: Mulliken charges with hydrogens summed into heavy atoms:
elementType: O N N C C C C
charge: -0.291573 -0.061789 0.070882 0.066156 0.127783 0.226898 -0.138357
polarizability: 8.47897903e+01 -1.48270440e+00 6.49315864e+01 6.60636423e+00 -1.36828213e+00 4.23947344e+01
1716.lowfreq: -12.4109 -5.3358 -0.0002 0.0002 0.0008 4.5940 56.2570 84.5882 93.5656
frequency: 56.1627 84.5669 93.5626 184.0833 231.4466 325.9788 372.0947 400.8358 418.6412 574.0858 697.1144 814.4741 916.0358 943.7079 956.7357 983.7243 996.5332 1092.7735 1129.5006 1155.6912 1230.5232 1252.7857 1287.6755 1337.4264 1356.2937 1402.1979 1431.4398 1458.8323 1478.6674 1479.1291 1660.7632 2948.6743 2977.7370 3000.0170 3064.1421 3093.1365 3098.6496 3134.6627 3203.9081
redmass: 2.5033 1.1191 2.6552 3.1426 3.3832 3.0893 6.6854 2.4025 3.5110 1.6337 3.0811 5.2344 1.5019 1.4737 1.5376 2.5208 1.1807 1.3113 2.3705 1.9160 1.2736 3.5924 1.2619 3.7521 1.7438 1.2380 1.2022 1.0685 1.0493 1.0795 4.7101 1.0592 1.0328 1.1004 1.1020 1.0618 1.0990 1.0941 1.1139
irintensity: 0.2929 0.3030 1.0162 3.9469 7.2590 4.8354 2.0773 0.4736 2.1424 7.2813 2.8985 16.4596 15.6664 72.6572 28.2103 126.8964 8.8865 2.3907 29.3101 16.0252 19.2682 6.5520 1.2249 114.6576 19.2421 29.7189 15.1211 10.7620 23.0888 22.0804 12.5720 28.5805 39.3198 25.0759 26.1161 8.1031 2.6361 4.1607 22.1491
temp: 298.150 k
press: 1.00000 atm
elementType: 8 7 7 6 6 6 6 1 1 1 1 1 1 1 1
symmnumber: 1
zpe: 312969.5 jmol-1
zpe.correction: 0.119204 hartree
zpe.thermalcorrener: 0.127535 hartree
zpe.thermalcorrenthalpy: 0.128479 hartree
zpe.thermalcorrgfe: 0.085781 hartree
zpe.sumelectzpe: -341.293557 hartree
zpe.sumelectthermal: -341.285226 hartree
zpe.sumelectthermalent: -341.284282 hartree
zpe.sumelectthermalfe: -341.326979 hartree
dipole: -1.6107 4.2469 0.2572
dipole: 4.5493
quadrupole: -43.3869 -44.5804 -40.7575
quadrupole: 6.7655 0.8327 -1.6407
quadrupole: -0.4786 -1.6721 2.1508 6.7655 0.8327 -1.6407
hfenergy: -341.4127604 hartree
pointgroup: C01 [X(C4H8N2O1)]
dipole: -0.6805427 -1.6411264 0.2170156 debye
dipolederiv: -0.9694276 -0.7929691 0.1472247 -0.1174478 -0.5472315 0.0513034 0.0028243 0.0498158 -0.232076 -0.2799306 0.0090513 0.0126096 -0.5040134 -0.751912 0.0895861 -0.0194167 0.0813356 -0.2254224 0.4705992 0.8177937 -0.1333124 0.615788 1.0250308 -0.1625986 -0.0657519 -0.1617223 -0.0322251 0.5478086 0.1793822 -0.0688599 0.2112704 0.1517771 0.0707537 0.0460054 0.0542836 0.2900872 0.0060258 -0.1970155 0.0183305 -0.1165779 0.0367758 0.0397561 0.0159308 0.0282437 0.2462835 0.1981057 -0.1255067 -0.0774784 -0.0902652 -0.0396364 -0.1112689 -0.0558686 -0.1056372 0.0639614 -0.3117225 -0.1164911 -0.0175265 -0.1256848 -0.1903965 -0.1890719 -0.026676 -0.1864202 -0.0144547 -0.0342474 -0.053766 0.0254433 -0.0302459 0.0512015 0.0446903 0.0441321 0.1038557 -0.1183853 -0.0309565 0.0361012 0.0434031 0.0012371 -0.0921407 -0.0941051 -0.0231187 -0.1210746 0.0234653 0.1107453 0.0316279 0.071625 0.0399651 0.0110084 0.0780974 0.0141362 0.1130841 -0.0821079 -0.0058889 0.0174284 -0.0103945 -0.1407631 0.1341642 -0.0095425 0.0169761 0.0001515 0.1387872 0.1097718 0.0245423 -0.0597863 0.0450223 -0.0479371 -0.0886775 -0.0071359 -0.1200828 -0.0346368 0.0708249 0.0109913 0.0495686 0.0479551 0.0805252 0.0795725 0.0208006 0.0825856 -0.0388452 0.0007414 0.1162023 -0.0214937 0.1330496 0.0786255 0.0754636 -0.0223136 0.0800507 0.0765553 0.1175509 0.042628 0.0206469 0.0307107 0.1001457 0.1260412 0.0594761 0.101531 -0.0609865 unknown
polarizability: 84.1782251|-0.5759479|63.7888906|-8.5315835|-4.888408|44.1489954 unknown
InChI: InChI=1S/C4H8N2O/c1-3-4-6(2)5-7/h3H,1,4H2,2H3
charge 0 multiplicity 1
15 atoms
O  2.112686 1.297235 -0.249726
N  0.706687 -0.448783 0.002195
N  0.886214 0.911893 -0.205336
C  -0.691056 -0.928054 0.099471
C  1.822124 -1.391339 0.185599
C  -1.718298 0.083473 -0.363692
C  -2.84603 0.370459 0.330435
H  -0.901009 -1.233575 1.144604
H  -0.760846 -1.843397 -0.526558
H  1.734559 -1.910896 1.157362
H  2.756427 -0.805822 0.159545
H  1.835101 -2.143521 -0.624612
H  -1.54071 0.541613 -1.344301
H  -3.599485 1.057472 -0.068701
H  -3.044463 -0.057857 1.320917
