program: Gaussian 09
title: 000236047
version: EM64L-G09RevD.01
frameworkgroup: C1[X(C20H18)]
method: RPBEPBE
basis: SDD
operation: Freq
keyword: #p
keyword: freq=noraman
keyword: PBEPBE/SDD
title: #p freq=noraman PBEPBE/SDD
converged: YES YES NO NO
title: Mulliken charges:
elementType: C C C C C C C C C C C C C C C C C C C C H H H H H H H H H H H H H H H H H H
charge: 0.500610 0.500613 -0.738892 -0.738892 -0.390802 -0.390773 -0.390803 -0.390833 0.498498 0.498497 -0.381695 -0.381714 -0.381692 -0.381673 -0.228392 -0.228393 -0.228390 -0.228389 -0.241927 -0.241927 0.214572 0.214572 0.214572 0.214572 0.220005 0.220005 0.220006 0.220005 0.221003 0.221003 0.221004 0.221005 0.222756 0.222757 0.222757 0.222756 0.226810 0.226810
chargesum: 0.00000
title: Mulliken charges with hydrogens summed into heavy atoms:
elementType: C C C C C C C C C C C C C C C C C C C C
charge: 0.500610 0.500613 -0.309747 -0.309748 -0.170798 -0.170768 -0.170797 -0.170828 0.498498 0.498497 -0.160692 -0.160712 -0.160688 -0.160668 -0.005636 -0.005636 -0.005634 -0.005633 -0.015118 -0.015117
polarizability: 2.12275497e+02 -7.14569508e-05 1.90407063e+02 2.37234122e-02 -3.16193903e-03 2.04168521e+02
1716.lowfreq: -29.0794 -19.0953 -0.0008 -0.0006 -0.0004 4.4691 7.0098 7.4775 22.8608
frequency: -28.3353 -19.0517 22.8608 36.9280 45.5601 59.6847 126.4340 205.2317 205.9593 210.8525 283.2335 338.3890 350.8792 380.8608 397.9382 400.9959 405.1109 425.2535 474.7107 483.0693 529.4203 573.8018 617.0340 617.8313 617.8852 638.5985 699.4150 701.5223 703.6425 737.4008 753.1265 781.2153 798.0838 820.2176 827.8017 840.5223 849.2062 851.9754 863.7767 908.3264 917.3210 925.0794 926.5593 955.5315 966.5287 973.5299 974.7678 989.9546 990.0492 992.8316 992.8473 1012.3201 1026.0476 1026.2180 1070.9791 1079.1308 1112.5400 1152.1298 1156.5431 1171.9824 1171.9971 1185.5927 1186.2136 1190.7902 1192.4755 1199.4248 1212.9639 1213.9124 1292.4235 1294.0947 1315.4217 1324.0066 1326.5149 1378.3903 1382.6733 1384.6014 1410.5746 1439.9101 1440.4254 1470.5198 1471.4072 1481.7965 1482.7824 1502.8438 1585.1563 1594.2339 1594.4085 1611.0349 1612.4859 1622.2470 2992.1631 2992.5545 3048.4908 3048.6089 3108.2981 3110.0745 3114.8340 3115.0357 3115.1145 3115.6751 3130.8462 3131.2351 3131.3504 3137.8172 3142.8613 3142.9916 3161.6425 3161.7487
redmass: 3.5945 3.7164 5.8958 3.6832 3.7961 5.3290 5.5672 4.8695 4.4711 4.6304 3.7534 5.7229 1.8307 1.8797 2.7734 2.8017 2.8295 4.2497 3.5238 3.1675 4.6830 4.6728 6.4019 6.2838 2.8568 6.3815 2.1722 3.1109 1.7065 1.9588 2.3250 2.2356 3.6961 2.9371 4.3859 1.2558 1.2509 1.2480 1.9324 1.7891 1.4543 1.6162 1.7647 1.4334 1.3930 1.3901 1.3828 6.0619 6.0625 1.3221 1.3221 3.0291 2.2284 2.2296 1.6092 1.5635 1.3768 1.0893 1.0948 1.0506 1.0501 1.1769 1.1361 2.0098 1.4831 2.6262 2.0379 3.1062 1.4670 1.4660 1.2886 1.2990 1.2539 8.0355 7.9517 6.3829 2.6845 2.1845 2.1660 1.1709 1.1773 2.1159 1.9886 2.4889 6.6967 6.0635 6.0006 6.2054 6.2015 6.4907 1.0594 1.0595 1.1027 1.1026 1.0867 1.0868 1.0855 1.0881 1.0855 1.0879 1.0960 1.0909 1.0909 1.0971 1.0959 1.0959 1.1015 1.1015
irintensity: 0.0000 0.0000 0.0501 0.0000 0.0000 0.1276 0.0697 0.4734 0.0059 2.4727 0.0000 0.1100 0.1239 0.0000 0.0000 0.0157 0.0000 1.4624 19.0870 3.3795 1.2783 5.3282 0.0000 0.0842 45.0009 0.0000 80.5510 12.1530 19.1563 92.4169 7.6423 14.0227 3.2648 4.7622 2.3071 0.1285 0.0000 0.9218 20.5914 1.1352 4.5017 3.4303 0.0000 0.3347 0.0000 0.5042 0.0000 0.2832 0.2446 0.0940 0.3625 6.7787 4.5861 9.3234 7.9635 0.0000 25.8445 0.0000 0.7319 0.0982 0.0001 0.2889 1.1522 0.0048 3.3297 0.4082 3.8519 1.0567 4.3136 2.4014 0.0000 1.4832 0.0000 1.0860 0.0000 0.0013 6.2411 0.0000 12.9814 4.9309 30.4475 30.6924 11.5601 28.0826 0.0000 3.0618 0.0000 12.7131 12.8701 0.1801 28.3063 52.1684 0.0115 22.4050 0.0001 46.5386 18.7281 4.3313 0.6196 0.0002 36.3852 20.1332 2.3062 3.2451 0.0293 97.5988 13.7459 33.1942
temp: 298.150 k
press: 1.00000 atm
elementType: 6 6 6 6 6 6 6 6 6 6 6 6 6 6 6 6 6 6 6 6 1 1 1 1 1 1 1 1 1 1 1 1 1 1 1 1 1 1
symmnumber: 1
zpe: 822255.1 jmol-1
zpe.correction: 0.313180 hartree
zpe.thermalcorrener: 0.328059 hartree
zpe.thermalcorrenthalpy: 0.329003 hartree
zpe.thermalcorrgfe: 0.269188 hartree
zpe.sumelectzpe: -771.549553 hartree
zpe.sumelectthermal: -771.534675 hartree
zpe.sumelectthermalent: -771.533731 hartree
zpe.sumelectthermalfe: -771.593546 hartree
dipole: 0.0000 -0.1432 0.0000
dipole: 0.1432
quadrupole: -119.3474 -113.5535 -102.5405
quadrupole: 0.0000 0.0045 -0.0011
quadrupole: -7.5336 -1.7397 9.2733 0.0000 0.0045 -0.0011
hfenergy: -771.8627338 hartree
pointgroup: C01 [X(C20H18)]
dipole: 0.0000046 0.0563282 -0.0000057 debye
polarizability: 212.2754968|-0.0015047|190.4070633|-0.0237232|0.0031635|204.1685206 unknown
InChI: InChI=1S/C20H18/c1-3-7-17(8-4-1)15-19-11-13-20(14-12-19)16-18-9-5-2-6-10-18/h1-14H,15-16H2
charge 0 multiplicity 1
38 atoms
C  -1.436243 1.668072 -0.000283
C  1.435317 1.667882 0.000011
C  -2.96678 1.64538 -0.000437
C  2.965848 1.644992 0.000166
C  -0.706159 1.670275 -1.215176
C  0.705482 1.670183 -1.215032
C  -0.706411 1.670842 1.214758
C  0.705234 1.670747 1.214901
C  -3.549508 0.22943 -0.000142
C  3.548396 0.228966 0.000089
C  -3.815677 -0.445516 1.218524
C  3.814772 -0.446088 -1.218472
C  -3.815389 -0.446151 -1.218521
C  3.813895 -0.446575 1.218573
C  -4.328382 -1.762294 1.221762
C  4.327307 -1.762933 -1.221506
C  -4.328092 -1.76293 -1.221191
C  4.326431 -1.763419 1.221447
C  -4.585505 -2.427082 0.000429
C  4.584052 -2.427679 -0.00007
H  -3.33681 2.189347 -0.889746
H  -3.336997 2.189787 0.888525
H  3.335946 2.189051 0.889391
H  3.336143 2.18921 -0.88888
H  -1.247703 1.678994 -2.169424
H  1.247222 1.678825 -2.169169
H  -1.248149 1.680011 2.16889
H  1.24678 1.67985 2.169144
H  -3.622506 0.064212 2.170894
H  3.621907 0.063609 -2.17092
H  -3.621996 0.063078 -2.171111
H  3.620326 0.062733 2.171085
H  -4.529657 -2.26752 2.173416
H  4.528747 -2.268243 -2.173079
H  -4.529142 -2.268655 -2.172627
H  4.527184 -2.26911 2.172964
H  -4.98414 -3.447815 0.000646
H  4.982556 -3.448463 -0.00013
