program: Gaussian 09
title: 000236033
version: EM64L-G09RevD.01
frameworkgroup: C1[X(C14H12O3)]
method: RPBEPBE
basis: SDD
operation: Freq
keyword: #pfreq=noraman
keyword: PBEPBE/SDD
title: #p freq=noraman PBEPBE/SDD
converged: YES YES NO NO
title: Mulliken charges:
elementType: O O O C C C C C C C C C C C C C C H H H H H H H H H H H H
charge: -0.188746 -0.171707 -0.156977 -0.262110 -0.239752 -0.615042 -0.486760 0.389212 -0.402775 0.193245 0.174649 0.323924 -0.405273 -0.403487 -0.238987 -0.229421 -0.238425 0.279040 0.275524 0.265501 0.232409 0.224280 0.249563 0.254445 0.250109 0.239391 0.229818 0.227020 0.231332
chargesum: 0.00000
title: Mulliken charges with hydrogens summed into heavy atoms:
elementType: O O O C C C C C C C C C C C C C C
charge: -0.188746 -0.171707 -0.156977 0.016930 0.035773 -0.117132 -0.012916 0.389212 -0.148330 0.193245 0.174649 0.323924 -0.155164 -0.164096 -0.009169 -0.002402 -0.007094
polarizability: 1.97234795e+02 -2.39013801e+01 1.53378705e+02 9.60762412e+00 6.25913749e+00 1.01541113e+02
1716.lowfreq: -7.6331 -2.5586 -0.0006 0.0002 0.0007 10.4132 32.0203 44.7036 56.6322
frequency: 31.8891 44.6959 56.6237 112.8946 133.7818 147.9060 214.5820 268.1721 281.9329 310.8304 361.0386 371.8130 406.6853 437.9828 491.7286 500.8168 527.8234 568.3092 581.1334 616.1271 619.1816 643.3515 664.2506 703.6975 720.8635 751.0582 767.2954 804.0171 830.4074 851.0469 855.2480 876.7965 918.6285 927.8392 949.8845 963.7559 974.6868 977.5142 989.4453 997.7300 1028.5736 1061.4424 1083.5184 1092.6948 1106.2623 1120.6053 1173.9953 1175.0434 1187.7523 1196.8714 1202.4730 1235.9273 1260.8653 1278.9624 1294.8216 1299.3428 1317.9707 1342.8074 1358.5991 1377.5197 1435.3890 1460.6189 1471.0846 1485.8005 1580.7419 1610.5677 1642.4383 1692.7596 1766.3595 2966.3222 2982.8937 3016.8074 3035.3519 3066.4834 3079.5280 3123.7811 3127.9040 3139.2168 3141.6388 3149.5355 3165.8254
redmass: 9.4014 6.8532 4.2663 4.3064 15.5195 5.3277 4.5338 3.8491 2.4606 3.5103 3.7303 7.7812 2.8484 4.4121 4.7206 3.3450 4.9190 3.4465 10.9851 6.1791 5.7560 4.6303 6.2145 1.7596 4.7345 4.0394 1.7870 3.1182 2.3050 1.8098 1.6577 3.6342 2.4034 1.7591 2.8488 2.3867 2.9872 1.5341 4.4206 1.3300 2.2076 2.2229 1.7173 1.8362 2.9367 2.2362 1.1550 1.3441 1.2630 1.1309 1.1993 1.7614 1.4770 1.9016 1.3722 1.5502 1.3970 1.5749 1.8641 6.2737 2.2891 1.1007 1.1084 2.1938 5.6991 5.9762 7.0593 12.7442 12.6519 1.0680 1.0684 1.0835 1.0854 1.0935 1.0928 1.0848 1.0876 1.0922 1.0924 1.0963 1.1016
irintensity: 0.9097 2.3451 0.6684 0.9656 3.0293 0.7714 1.6960 0.2123 5.9735 2.4718 0.9118 7.8319 0.3817 5.0031 1.1145 7.6114 30.8568 9.7390 1.3780 0.2725 0.8538 1.8474 1.2714 46.1749 6.6284 5.6697 77.8404 22.4371 129.2791 4.6155 5.5936 136.8084 30.2057 20.0369 5.2043 7.2591 6.6507 0.3294 0.0232 0.0209 13.5901 18.8496 13.0653 8.9894 112.4986 26.0617 9.7347 19.0790 11.1514 1.5932 7.0202 4.6092 2.9027 2.9791 3.9363 6.5375 2.5007 5.9515 8.8499 2.7385 7.5742 18.0169 12.0193 16.4290 3.3126 2.4331 2.1248 426.7297 89.0663 39.5517 15.0614 7.9954 24.4787 11.8247 4.8008 4.3162 0.1223 19.6401 1.6845 34.7094 25.1108
temp: 298.150 k
press: 1.00000 atm
elementType: 8 8 8 6 6 6 6 6 6 6 6 6 6 6 6 6 6 1 1 1 1 1 1 1 1 1 1 1 1
symmnumber: 1
zpe: 589702.5 jmol-1
zpe.correction: 0.224606 hartree
zpe.thermalcorrener: 0.238156 hartree
zpe.thermalcorrenthalpy: 0.239100 hartree
zpe.thermalcorrgfe: 0.183154 hartree
zpe.sumelectzpe: -765.160037 hartree
zpe.sumelectthermal: -765.146487 hartree
zpe.sumelectthermalent: -765.145543 hartree
zpe.sumelectthermalfe: -765.201488 hartree
dipole: -1.3617 -2.7066 4.5151
dipole: 5.4375
quadrupole: -96.0892 -99.9355 -101.9525
quadrupole: -2.1293 17.0645 1.7181
quadrupole: 3.2365 -0.6098 -2.6267 -2.1293 17.0645 1.7181
hfenergy: -765.3846426 hartree
pointgroup: C01 [X(C14H12O3)]
dipole: 0.4291705 -0.3967793 2.0578656 debye
polarizability: 195.4153376|-18.6690075|140.7863522|-17.5620198|26.2274979|115.9529229 unknown
InChI: InChI=1S/C14H12O3/c15-13-11-7-6-10(8-12(11)14(16)17-13)9-4-2-1-3-5-9/h1-6,11-12H,7-8H2
charge 0 multiplicity 1
29 atoms
O  -2.356917 0.259504 -1.773643
O  -1.160411 -1.737623 -1.917116
O  -3.367268 2.20582 -0.973545
C  -1.784129 -0.828346 0.327024
C  -2.454564 0.532562 0.646231
C  -0.368722 -1.003323 0.949629
C  -1.535628 1.503981 1.459328
C  0.490638 0.23779 0.723331
C  -0.102765 1.446478 0.967054
C  -1.697952 -0.88615 -1.203944
C  -2.804687 1.139916 -0.717713
C  1.900089 0.098319 0.264875
C  2.277228 -0.915487 -0.660495
C  2.904667 0.992557 0.731927
C  3.610545 -1.021236 -1.111099
C  4.23715 0.884943 0.282424
C  4.597308 -0.123493 -0.642216
H  -2.420091 -1.675321 0.64593
H  -3.404763 0.406502 1.196246
H  0.098965 -1.9127 0.538338
H  -0.492293 -1.174848 2.038148
H  -1.589252 1.198074 2.525202
H  -1.946578 2.526059 1.396345
H  0.431507 2.385669 0.785881
H  1.52162 -1.599876 -1.063608
H  2.639844 1.756296 1.472123
H  3.876586 -1.799313 -1.835074
H  4.99673 1.578532 0.660337
H  5.632745 -0.210283 -0.989523
