program: Gaussian 09
title: 000236032
version: EM64L-G09RevD.01
frameworkgroup: C1[X(C14H10O6S)]
method: RPBEPBE
basis: SDD
operation: Freq
keyword: #p
keyword: freq=noraman
keyword: PBEPBE/SDD
title: #p freq=noraman PBEPBE/SDD
converged: YES YES NO NO
title: Mulliken charges:
elementType: S O O O O O O C C C C C C C C C C C C C C H H H H H H H H H H
charge: 0.868747 -0.515469 -0.538492 -0.378829 -0.420122 -0.277984 -0.201920 -0.091040 -0.081194 -0.370374 -0.333946 -0.187543 -0.208329 0.278064 0.258747 -0.313195 -0.354709 0.144385 0.187459 -0.160068 -0.191165 0.290538 0.311295 0.284800 0.291844 0.275356 0.239564 0.213887 0.221582 0.383984 0.374130
chargesum: 0.00000
title: Mulliken charges with hydrogens summed into heavy atoms:
elementType: S O O O O O O C C C C C C C C C C C C C C
charge: 0.868747 -0.515469 -0.538492 0.005155 -0.045992 -0.277984 -0.201920 -0.091040 -0.081194 -0.079835 -0.022651 0.097257 0.083514 0.278064 0.258747 -0.037839 -0.115146 0.144385 0.187459 0.053818 0.030417
polarizability: 2.60554507e+02 1.06698856e+01 1.99607596e+02 7.82564556e+00 2.69983652e+01 1.53616652e+02
1716.lowfreq: -6.6108 -3.7008 -3.0533 -0.0010 0.0009 0.0011 16.1404 25.6521 31.0676
frequency: 16.0705 25.6380 31.0637 94.7736 98.2324 117.4131 128.6096 147.7805 154.6729 188.0136 194.2577 210.6873 225.9313 251.7319 282.9168 287.2782 323.5316 327.4691 335.1060 380.7697 403.4313 411.4058 431.4776 440.8104 452.1484 453.9754 462.4630 514.3851 557.6615 567.7601 586.7771 611.5004 624.6550 689.5596 735.8946 738.8519 749.6235 779.3988 795.7774 826.0155 846.7028 858.6766 874.1913 907.5223 928.4429 929.5030 939.8345 965.3181 971.3341 979.4091 1000.4947 1052.6441 1058.9577 1086.5548 1126.0934 1155.8382 1183.8399 1203.7310 1227.9299 1249.3653 1261.2127 1272.0746 1338.4075 1359.6645 1371.4767 1403.7579 1406.8371 1411.5331 1423.8817 1455.3854 1469.9816 1557.0831 1574.7607 1576.1415 1602.7583 1612.7557 1632.3104 2839.7926 2970.2400 2985.0496 3129.9918 3132.7281 3145.8361 3152.4060 3160.1617 3185.1964 3582.9890
redmass: 7.8922 7.4250 6.5838 7.0933 11.1338 7.0061 6.8118 6.2538 6.1792 3.2071 7.8214 9.8869 8.6004 8.8174 3.6842 6.5775 6.3084 5.5420 5.6622 7.5671 1.1820 6.2348 7.3350 3.4343 3.1241 5.8896 8.1301 5.0941 3.5042 3.6013 6.4913 7.5018 7.6734 7.2795 3.5249 3.5587 5.0430 14.0991 5.8050 1.5032 1.5466 5.9404 5.8538 1.4460 5.8245 1.2853 1.4057 1.3709 1.5147 1.4172 1.7701 2.1345 2.0379 2.2025 1.5534 1.2158 2.3382 2.0400 1.4708 2.6947 1.3388 3.1184 1.4000 2.0668 1.6725 5.3888 3.4288 3.9810 4.5808 2.5519 2.7229 3.2836 6.5923 7.0397 6.9952 7.0351 4.7869 1.0711 1.0876 1.0896 1.0898 1.0921 1.0919 1.0906 1.0955 1.0958 1.0663
irintensity: 1.5613 2.2423 0.2569 3.9838 3.9297 4.9929 1.3251 3.7760 0.4873 8.6443 2.1513 7.5204 10.2911 3.0488 2.8407 7.1709 11.7491 4.4735 13.4489 3.6154 153.6475 11.6813 17.4288 10.8100 15.4193 45.3570 99.5496 12.9931 39.5189 46.1217 15.4129 16.1546 26.6393 22.2913 0.6352 0.4165 4.2861 77.7264 19.7145 36.5190 60.9867 47.6949 18.3575 12.0376 60.4198 99.1183 2.2123 0.3930 23.3856 10.3208 7.3479 91.3907 37.6512 144.1119 15.5844 23.8843 82.4365 69.6799 70.6905 29.5419 111.7829 107.2407 151.2012 65.9538 3.9436 36.8147 27.0774 119.6555 20.8984 122.1585 21.7912 28.6763 129.2933 126.1609 65.9745 71.9503 191.1749 280.9000 59.6901 35.8109 8.9756 3.7702 6.7470 3.4377 8.5750 1.4104 73.2028
temp: 298.150 k
press: 1.00000 atm
elementType: 16 8 8 8 8 8 8 6 6 6 6 6 6 6 6 6 6 6 6 6 6 1 1 1 1 1 1 1 1 1 1
symmnumber: 1
zpe: 551576.1 jmol-1
zpe.correction: 0.210084 hartree
zpe.thermalcorrener: 0.229266 hartree
zpe.thermalcorrenthalpy: 0.230210 hartree
zpe.thermalcorrgfe: 0.160834 hartree
zpe.sumelectzpe: -1387.224942 hartree
zpe.sumelectthermal: -1387.205760 hartree
zpe.sumelectthermalent: -1387.204816 hartree
zpe.sumelectthermalfe: -1387.274193 hartree
dipole: 2.3042 -2.9302 -6.4333
dipole: 7.4353
quadrupole: -130.9703 -134.5974 -136.7416
quadrupole: -13.8648 -21.9033 13.8835
quadrupole: 3.1328 -0.4943 -2.6385 -13.8648 -21.9033 13.8835
hfenergy: -1387.4350264 hartree
pointgroup: C01 [X(C14H10O6S1)]
dipole: 0.8707333 -2.3677118 -1.480844 debye
polarizability: 260.8816784|12.5379318|210.1508474|0.0374219|-10.5924498|142.7462287 unknown
InChI: InChI=1S/C14H10O6S/c15-7-9-5-11(1-3-13(9)17)21(19,20)12-2-4-14(18)10(6-12)8-16/h1-8,17-18H
charge 0 multiplicity 1
31 atoms
S  0.106172 0.039046 1.910531
O  0.478763 1.474253 2.598778
O  -0.243023 -1.321815 2.756794
O  -4.687392 1.137084 -1.616267
O  4.804514 -1.437086 -1.63488
O  -5.433746 -1.295771 -1.237148
O  3.986901 2.543215 -1.117365
C  -1.375384 0.349794 0.779295
C  1.545911 -0.419715 0.767338
C  -2.277485 -0.690223 0.572909
C  2.313591 0.598125 0.198408
C  -1.556684 1.650371 0.249976
C  1.83225 -1.787606 0.599129
C  -3.416883 -0.443068 -0.242297
C  3.415231 0.246044 -0.62313
C  -2.673299 1.906759 -0.559653
C  2.92815 -2.147065 -0.20776
C  -3.606652 0.867176 -0.822041
C  3.711533 -1.135955 -0.821749
C  -4.402098 -1.48686 -0.498251
C  4.239107 1.314926 -1.250682
H  -2.121877 -1.664777 1.052207
H  2.113672 1.660485 0.381216
H  -0.844399 2.444887 0.497999
H  1.224155 -2.539343 1.113513
H  -2.853233 2.894695 -0.991004
H  3.17697 -3.205425 -0.352667
H  -4.241512 -2.479777 -0.028597
H  5.103112 0.963806 -1.855574
H  -5.257634 0.279779 -1.684764
H  4.951172 -2.412664 -1.709166
