program: Gaussian 09
title: 000236031
version: EM64L-G09RevD.01
frameworkgroup: C1[X(C13H20O4)]
method: RPBEPBE
basis: SDD
operation: Freq
keyword: #pfreq=noraman
keyword: PBEPBE/SDD
title: #p freq=noraman PBEPBE/SDD
converged: YES YES NO NO
title: Mulliken charges:
elementType: O O O O C C C C C C C C C C C C C H H H H H H H H H H H H H H H H H H H H
charge: -0.273430 -0.273545 -0.254412 -0.254497 -0.382845 -0.423628 -0.424587 -0.077086 -0.076553 -0.064384 -0.063614 0.284111 0.284308 -0.576809 -0.577190 -0.757622 -0.757848 0.218669 0.218820 0.213314 0.235102 0.213508 0.234882 0.241715 0.241540 0.240697 0.240482 0.221014 0.223191 0.220969 0.223329 0.249857 0.246404 0.244786 0.246341 0.244967 0.250046
chargesum: 0.00000
title: Mulliken charges with hydrogens summed into heavy atoms:
elementType: O O O O C C C C C C C C C C C C C
charge: -0.273430 -0.273545 -0.254412 -0.254497 0.054644 0.024787 0.023804 0.164629 0.164987 0.176313 0.176868 0.284111 0.284308 -0.132604 -0.132892 -0.016575 -0.016495
polarizability: 1.57559313e+02 -9.44380808e-02 1.63116195e+02 -5.43968128e+00 4.93454709e-02 1.40803959e+02
1716.lowfreq: -10.2836 -5.8297 -3.3288 0.0003 0.0007 0.0009 12.0413 26.2515 32.6181
frequency: 11.9876 26.2256 32.6166 38.0455 43.9381 47.3860 50.5522 66.2329 67.4354 81.7100 93.3589 96.4298 123.9299 162.3545 178.6597 225.8867 229.8950 267.8924 292.3649 332.6274 343.8286 366.4324 368.5596 428.3480 439.7550 516.3558 527.8438 566.2294 569.0230 612.1087 620.6228 669.3869 677.2368 752.5903 823.9059 844.5689 851.1926 864.8345 896.9902 922.0075 940.9617 959.0907 961.2686 993.0591 994.8071 998.3810 1003.2126 1003.7432 1038.0981 1041.4502 1042.8411 1051.5582 1061.7320 1095.2568 1120.2625 1186.0575 1200.3203 1202.0021 1205.1626 1234.3003 1251.8506 1273.9091 1280.4838 1281.8418 1298.2741 1305.8401 1315.4468 1325.9179 1339.5485 1360.0829 1382.5550 1382.7901 1432.2542 1432.5235 1452.8289 1453.0989 1455.5067 1455.7675 1462.2975 1464.5519 1480.9688 1641.8616 1642.6362 1661.1128 1661.2281 2976.0744 2982.3206 2988.3795 3006.0683 3006.1146 3019.7338 3024.9407 3028.0737 3047.2266 3062.4740 3089.1913 3089.2390 3097.6648 3098.7373 3106.0534 3106.1328 3140.7385 3141.0382 3199.7696 3199.8230
redmass: 4.7647 5.2061 4.5313 1.4413 1.9683 3.0313 1.4483 2.6711 2.7958 2.7286 3.5105 1.9881 2.7773 3.2921 4.0051 2.9884 4.3052 2.2178 2.8715 2.8206 3.0214 4.1341 3.0481 2.6736 3.0944 3.5519 2.8777 3.2261 3.1443 4.5591 4.1163 1.9705 1.9258 1.1557 1.6504 4.5620 4.7476 2.2951 3.0302 4.1572 1.9599 1.3021 1.3068 1.8192 1.8433 1.3730 1.1762 1.1809 2.1165 1.6769 1.7557 2.9801 1.8959 2.6543 2.6117 2.2288 3.2072 2.5490 2.0047 1.2360 1.3130 1.2565 1.2525 1.2451 1.1607 1.3404 1.3158 1.2790 1.3455 1.5225 1.2441 1.2434 1.2172 1.2183 1.0600 1.0599 1.0524 1.0527 1.0900 1.0695 1.0988 9.3166 9.2554 4.8624 4.8527 1.0591 1.0596 1.0591 1.0379 1.0376 1.0955 1.0864 1.0900 1.1022 1.1042 1.0606 1.0607 1.0956 1.0949 1.0936 1.0936 1.1017 1.1020 1.1145 1.1146
irintensity: 0.7469 1.4942 0.0248 1.5786 0.7848 0.3359 0.5567 2.4961 1.2342 1.9658 0.9239 0.4848 0.2121 7.1861 0.5744 8.2273 0.9444 1.8057 0.4888 0.4612 7.4017 12.0942 8.8528 0.9662 1.5176 2.5740 1.1210 0.4077 5.5931 0.0871 30.6391 14.3669 1.6054 7.2667 0.2302 1.5625 21.1174 7.4303 19.1216 213.2735 54.8034 161.6837 8.3164 115.0040 39.7792 7.9715 0.5252 20.5281 4.8241 6.5987 10.6133 21.0501 8.9210 19.0405 7.1951 30.7078 524.6249 118.7996 54.3835 3.1004 18.2524 4.5176 1.5347 2.3485 0.2501 0.0654 1.8714 1.4213 1.2863 0.6033 54.3485 54.3217 7.8692 22.3533 21.5886 26.8098 20.7855 20.6119 0.3088 0.4770 7.4404 122.7792 228.8459 5.0881 5.7097 0.6813 0.8591 51.0600 3.0444 3.1359 0.1043 22.7618 1.3714 0.5882 57.0817 8.0548 13.2037 8.9525 9.1604 0.2594 13.9089 10.0786 9.6009 19.8106 22.5489
temp: 298.150 k
press: 1.00000 atm
elementType: 8 8 8 8 6 6 6 6 6 6 6 6 6 6 6 6 6 1 1 1 1 1 1 1 1 1 1 1 1 1 1 1 1 1 1 1 1
symmnumber: 1
zpe: 797729.1 jmol-1
zpe.correction: 0.303839 hartree
zpe.thermalcorrener: 0.324991 hartree
zpe.thermalcorrenthalpy: 0.325935 hartree
zpe.thermalcorrgfe: 0.248222 hartree
zpe.sumelectzpe: -806.914507 hartree
zpe.sumelectthermal: -806.893355 hartree
zpe.sumelectthermalent: -806.892411 hartree
zpe.sumelectthermalfe: -806.970123 hartree
dipole: -0.0134 -0.4492 0.0088
dipole: 0.4494
quadrupole: -98.9660 -90.8523 -110.8940
quadrupole: -0.0984 11.7655 0.1077
quadrupole: 1.2714 9.3851 -10.6565 -0.0984 11.7655 0.1077
hfenergy: -807.2183457 hartree
pointgroup: C01 [X(C13H20O4)]
dipole: -0.0040601 -0.1765503 -0.0089529 debye
polarizability: 157.564112|0.2495861|163.0028|-5.4307856|1.5757904|140.9125554 unknown
InChI: InChI=1S/C13H20O4/c1-5-12(16-10(3)14)8-7-9-13(6-2)17-11(4)15/h5-6,12-13H,1-2,7-9H2,3-4H3
charge 0 multiplicity 1
37 atoms
O  3.708067 -0.545497 0.490494
O  -3.710935 -0.515838 -0.578231
O  3.937742 -0.347424 -1.82673
O  -3.919775 -0.685447 1.743106
C  -0.008592 0.43514 0.030839
C  1.256909 -0.437731 0.184402
C  -1.258381 -0.420624 -0.273884
C  2.526054 0.399573 0.455933
C  -2.541335 0.429442 -0.402601
C  2.530838 1.093487 1.795114
C  -2.565478 1.324902 -1.61601
C  4.315178 -0.835469 -0.736145
C  -4.30154 -1.003212 0.592627
C  2.594978 2.437697 1.954016
C  -2.658591 2.675743 -1.562236
C  5.454803 -1.812672 -0.539827
C  -5.427649 -1.957835 0.256811
H  0.145957 1.172498 -0.781693
H  -0.175424 1.01552 0.959716
H  1.118511 -1.164087 1.00951
H  1.418005 -1.016998 -0.744954
H  -1.107232 -0.993374 -1.210139
H  -1.40845 -1.152651 0.542851
H  2.68961 1.113556 -0.373162
H  -2.708843 1.000924 0.52966
H  2.459713 0.432365 2.670978
H  -2.48408 0.811256 -2.584933
H  2.571151 2.899557 2.947225
H  2.672054 3.115909 1.0950
H  -2.648404 3.287825 -2.470902
H  -2.746732 3.209192 -0.607542
H  6.060119 -1.532329 0.337415
H  5.048964 -2.823667 -0.354199
H  6.079899 -1.839553 -1.444348
H  -5.00757 -2.941485 -0.02203
H  -6.07696 -2.087536 1.135183
H  -6.009679 -1.588058 -0.602313
