program: Gaussian 09
title: 000236020
version: EM64L-G09RevD.01
frameworkgroup: C1[X(C8H14S)]
method: RPBEPBE
basis: SDD
operation: Freq
keyword: #pfreq=noraman
keyword: PBEPBE/SDD
title: #p freq=noraman PBEPBE/SDD
converged: YES YES NO NO
title: Mulliken charges:
elementType: S C C C C C C C C H H H H H H H H H H H H H H
charge: -0.025875 0.000939 -0.456213 -0.480426 -0.352721 -0.453008 -0.214676 -0.184014 -0.758528 0.207177 0.210114 0.201517 0.215020 0.210803 0.201798 0.219200 0.211527 0.211241 0.200445 0.202748 0.258714 0.283325 0.090891
chargesum: 0.00000
title: Mulliken charges with hydrogens summed into heavy atoms:
elementType: S C C C C C C C C
charge: 0.065016 0.208116 -0.044582 -0.054602 0.068277 -0.030239 -0.014231 0.018734 -0.216489
polarizability: 1.27776836e+02 -2.36508137e+00 9.61958721e+01 5.12856971e+00 -4.04937647e+00 6.93864397e+01
1716.lowfreq: -10.6118 -0.0028 0.0012 0.0022 8.8569 20.1637 63.0718 88.9078 105.0049
frequency: 63.0390 88.8768 104.9201 151.9565 203.5255 205.6174 243.0949 335.2071 380.5788 421.3441 481.9939 497.4806 658.9294 676.9558 727.2561 739.3666 789.5073 833.5375 868.8730 905.4577 926.2856 943.8058 974.1388 991.5322 1037.5498 1065.8156 1075.0785 1088.4785 1103.2999 1138.4336 1146.9139 1191.2760 1224.2316 1249.7292 1255.0702 1280.7283 1291.5910 1303.6121 1329.6952 1333.1839 1344.0451 1355.6917 1381.5847 1448.6239 1455.7000 1459.8681 1463.2158 1473.1180 1676.4954 2425.4995 2935.8279 2949.8599 2952.7490 2966.0566 2971.7936 2999.8044 3005.2882 3022.8157 3027.3639 3035.4819 3090.5015 3099.8914 3123.2560
redmass: 3.8356 1.9671 3.8150 2.2072 2.2450 1.2511 3.1564 3.2799 2.1522 1.8546 3.9250 4.2465 1.2671 3.1560 1.9358 1.3738 1.5079 1.3997 2.8050 1.8586 1.9458 2.2382 1.2095 1.6386 3.3796 1.9154 1.8705 2.3143 1.9501 1.1527 1.1681 1.2016 1.2389 1.2633 1.1830 1.2188 1.2289 1.2793 1.3586 1.5166 1.5037 1.7107 1.5447 1.0819 1.0944 1.0777 1.0928 1.0913 6.3769 1.0383 1.0676 1.0775 1.0641 1.0606 1.0631 1.0944 1.0933 1.0786 1.0827 1.1000 1.0837 1.1061 1.0993
irintensity: 0.9712 2.1319 0.2644 0.0521 0.2539 21.7830 5.6361 1.5282 0.3375 1.8489 2.0710 0.4693 46.2304 11.9402 9.8336 4.0810 3.5504 7.8210 3.0110 5.5860 6.8772 3.6373 0.1939 1.9857 5.5304 1.0834 1.3469 1.4072 3.4183 5.1801 3.8268 5.3384 3.7060 2.0507 0.5748 4.3656 2.3338 3.2568 4.3549 1.6617 0.3765 3.8428 0.0204 3.3768 0.4811 14.4316 2.6087 14.5835 5.0817 30.6962 22.7884 14.0976 53.0087 3.8068 50.8663 31.8300 43.3296 13.3899 16.0143 91.6946 8.9926 20.9796 68.8617
temp: 298.150 k
press: 1.00000 atm
elementType: 16 6 6 6 6 6 6 6 6 1 1 1 1 1 1 1 1 1 1 1 1 1 1
symmnumber: 1
zpe: 520330.7 jmol-1
zpe.correction: 0.198183 hartree
zpe.thermalcorrener: 0.208251 hartree
zpe.thermalcorrenthalpy: 0.209195 hartree
zpe.thermalcorrgfe: 0.162288 hartree
zpe.sumelectzpe: -710.564409 hartree
zpe.sumelectthermal: -710.554341 hartree
zpe.sumelectthermalent: -710.553397 hartree
zpe.sumelectthermalfe: -710.600304 hartree
dipole: 1.7118 -0.8905 0.7957
dipole: 2.0872
quadrupole: -73.2153 -60.6152 -65.4011
quadrupole: 2.4772 -2.1173 -1.3908
quadrupole: -6.8047 5.7953 1.0094 2.4772 -2.1173 -1.3908
hfenergy: -710.7625921 hartree
pointgroup: C01 [X(C8H14S1)]
dipole: -0.6761323 0.3398825 0.318832 debye
dipolederiv: -0.3807723 -0.000505 -0.0812146 -0.0948393 0.0208037 0.179261 -0.104576 0.1475211 -0.1472116 0.0165992 0.0201325 -0.0008757 0.1439882 0.0552006 0.010717 -0.0601924 0.0249652 0.1635481 -0.0426924 0.0416016 0.0142594 -0.0218333 0.0702666 0.0353381 0.0414858 0.0067589 0.1380689 -0.0944242 -0.0560457 0.0165456 -0.0129744 -0.0002597 -0.0329432 0.0846071 -0.0375591 0.1988554 -0.1225317 0.0166337 -0.0079613 -0.0494212 0.0618376 0.0553201 0.06937 0.0427164 0.0987518 -0.0004971 -0.0207284 0.023905 -0.0142489 -0.0213012 -0.0146612 0.0111424 -0.0617788 0.2041741 0.2237154 0.0350003 -0.0478257 0.0524725 0.0128168 0.0252728 -0.0829838 0.0272019 -0.2320852 0.0063128 0.0670111 -0.017809 0.0460387 0.1771247 0.0497506 -0.0179678 0.0709045 -0.2409689 0.4296714 0.0285739 -0.0556947 0.1432383 0.0826677 -0.053003 0.0121477 -0.0046584 0.1225226 0.0418462 0.00821 0.0097632 -0.0197534 0.0193341 -0.0038841 0.0019084 -0.0024131 -0.1883116 0.0308141 0.0083812 0.0258651 0.0190207 0.0742361 -0.0394781 0.0085133 0.0314745 -0.1709379 0.0245802 -0.1069261 -0.0166785 -0.080098 -0.1769948 -0.0363124 -0.0213679 -0.0630949 0.0601075 -0.0170462 0.1065391 -0.0487065 0.0919293 -0.0664094 0.071956 -0.0956124 0.0907754 0.0251025 -0.0101785 0.0381029 0.0845532 -0.0345584 0.0757327 -0.0010662 0.090851 -0.060396 -0.1297683 0.0115766 -0.0506397 -0.0109619 -0.0650126 -0.1442912 -0.0514598 -0.0386154 -0.0695047 0.0467351 0.0588386 0.0036938 -0.0086467 0.0255021 0.0597498 -0.0025069 -0.002018 0.0231634 -0.1412602 -0.0944543 0.0821049 -0.0733995 0.1038066 -0.0443431 0.0534653 -0.0951939 0.1060968 0.0362822 0.0796409 -0.050311 0.0068936 0.0114691 -0.0053702 -0.0666577 0.0719553 -0.0977163 -0.1474519 -0.0240321 -0.0832303 -0.0005257 -0.1122602 -0.1440564 -0.0298953 -0.0022382 -0.0262794 0.1516155 -0.1795413 -0.077518 0.0307607 -0.0676336 0.0243012 -0.0000915 0.0290288 -0.000257 0.1522734 -0.0477618 -0.022481 0.0760837 -0.0032298 0.0630089 0.0044418 0.0330242 0.0469064 -0.13758 0.0586015 -0.049331 0.0003032 -0.0199281 -0.077786 -0.0380662 0.004966 -0.0550746 0.0711423 0.031735 0.0617311 0.0813671 -0.0416741 -0.1162688 -0.1154971 0.0617658 -0.1397523 0.0663962 unknown
polarizability: 127.820275|-2.0723309|95.9984186|-5.1098317|4.5401786|69.5404538 unknown
InChI: InChI=1S/C8H14S/c9-7-6-8-4-2-1-3-5-8/h1-2,8-9H,3-7H2
charge 0 multiplicity 1
23 atoms
S  4.323371 0.030602 -0.094936
C  0.040956 0.248524 0.245372
C  -0.938646 1.323707 -0.292427
C  -0.402561 -1.154996 -0.246955
C  1.499597 0.582728 -0.16354
C  -2.380703 1.089712 0.21478
C  -1.90205 -1.371314 -0.130521
C  -2.790305 -0.367654 0.096026
C  2.541656 -0.388556 0.41618
H  -0.025984 0.257032 1.355608
H  -0.930349 1.288575 -1.401084
H  -0.592751 2.334475 0.000836
H  0.120598 -1.946821 0.326016
H  -0.086152 -1.290789 -1.305189
H  1.738329 1.612067 0.175458
H  1.583421 0.586543 -1.268791
H  -3.090121 1.723475 -0.354509
H  -2.47129 1.414598 1.273542
H  -2.266595 -2.403566 -0.229712
H  -3.859421 -0.602406 0.196106
H  2.498869 -0.418488 1.518648
H  2.403679 -1.414141 0.035724
H  4.350154 1.289393 0.486565
