program: Gaussian 09
title: 000236016
version: EM64L-G09RevD.01
frameworkgroup: C1[X(C20H14Cl2)]
method: RPBEPBE
basis: SDD
operation: Freq
keyword: #p
keyword: freq=noraman
keyword: PBEPBE/SDD
title: #p freq=noraman PBEPBE/SDD
converged: YES YES NO NO
title: Mulliken charges:
elementType: Cl Cl C C C C C C C C C C C C C C C C C C C C H H H H H H H H H H H H H H
charge: -0.055828 -0.053758 0.279385 0.299417 0.247936 -0.463249 0.409450 -0.399625 -0.386928 -0.377513 -0.390712 -0.367288 -0.402941 -0.219775 -0.204138 -0.213517 -0.207431 -0.119631 -0.126975 -0.237238 -0.244364 -0.245188 0.226208 0.254254 0.269791 0.260739 0.262346 0.258768 0.233071 0.255369 0.257287 0.256155 0.257091 0.229682 0.228055 0.231096
chargesum: 0.00000
title: Mulliken charges with hydrogens summed into heavy atoms:
elementType: Cl Cl C C C C C C C C C C C C C C C C C C C C
charge: -0.055828 -0.053758 0.279385 0.299417 0.247936 -0.237041 0.409450 -0.145371 -0.117137 -0.116775 -0.128365 -0.108520 -0.169870 0.035594 0.053149 0.042638 0.049659 -0.119631 -0.126975 -0.007556 -0.016309 -0.014092
polarizability: 3.67592094e+02 2.87964990e+01 2.85735079e+02 5.60663227e+00 8.48386772e+00 1.34140179e+02
1716.lowfreq: 0.0019 0.0022 0.0022 3.2159 5.3403 7.8487 29.1835 36.1566 39.3731
frequency: 29.1361 36.1220 39.3723 43.1146 50.8929 72.1556 121.7277 129.6365 150.7073 179.6199 206.2944 221.7320 254.0345 303.8522 311.5854 320.6300 364.5524 397.5279 404.9565 409.4701 413.6330 441.2623 480.2318 500.6743 517.5559 582.9024 603.1141 609.9415 620.2999 630.5092 645.1514 687.4071 698.7318 719.0264 726.8486 742.7251 769.1211 810.8705 828.2486 831.8273 833.1984 841.0167 849.9106 886.7135 915.4912 937.3895 955.4132 958.1869 967.3732 971.2214 978.4478 987.5686 996.1890 997.5741 1000.4175 1027.6173 1071.9033 1074.3875 1085.6557 1107.3075 1112.2042 1140.7910 1173.2835 1185.2473 1189.3267 1193.7261 1230.2269 1262.5307 1292.4837 1296.1138 1322.9186 1345.3836 1355.6944 1371.4786 1389.8794 1392.8665 1399.4435 1437.5748 1471.4923 1479.8533 1483.3294 1569.1286 1571.0214 1577.5006 1589.5488 1593.7458 1606.0950 1609.6344 3088.5020 3117.5980 3129.2643 3141.3925 3142.2253 3143.1946 3146.1421 3150.1443 3158.2269 3168.9691 3170.2683 3170.6555 3172.6236 3174.3592
redmass: 6.7020 5.2995 6.1186 6.1447 4.7606 3.9581 7.2686 6.7536 5.9012 6.9283 9.4226 6.7546 6.8777 4.5499 6.0694 5.5737 4.2611 8.5061 2.8685 2.9179 2.9489 6.0569 3.6615 3.4254 3.1982 6.2917 5.2482 5.3077 6.4687 6.5181 4.7362 6.5413 1.7427 3.6875 3.9658 3.3061 2.1259 2.6978 1.3064 1.5619 1.2748 1.9183 1.2862 1.4439 2.2877 1.9916 1.3471 1.4640 1.3727 1.3646 1.3909 6.0321 1.3459 3.9758 3.9797 2.2092 2.8990 2.7353 1.6433 1.3629 1.3784 3.0475 1.0568 1.1232 1.1260 1.1156 2.0134 3.2296 1.2626 1.2665 1.6706 2.5323 5.0953 4.5332 3.3673 3.6299 2.8170 2.2667 2.2800 2.5815 2.3080 7.1616 7.4518 6.0576 6.1339 6.2419 6.8277 6.3895 1.0874 1.0870 1.0869 1.0888 1.0928 1.0893 1.0887 1.0889 1.0963 1.0956 1.0991 1.0959 1.0969 1.0973
irintensity: 0.0901 0.0579 0.0542 0.0153 0.0533 0.0362 0.1983 0.0425 0.6004 0.2816 1.5950 0.0686 0.4127 0.5581 0.7606 1.9514 0.1295 17.7611 1.5132 0.0792 0.3614 2.8448 26.6748 29.7896 11.5971 7.1735 1.6764 4.7312 1.3228 1.5032 5.2024 20.7705 52.3250 2.7801 4.1643 34.4704 19.9561 19.5141 22.4978 64.0130 4.4640 17.5785 2.9005 9.4193 5.8032 28.5682 0.4095 4.0554 2.4056 0.2820 0.4433 0.1940 3.2428 33.3396 46.7910 6.5454 40.0688 60.1758 7.4679 9.7754 7.2756 2.7246 0.0148 0.1781 0.7340 2.1879 2.3269 2.1076 0.4696 0.8220 2.5425 0.6400 2.1966 5.5587 10.3245 5.0584 15.8642 13.7175 35.2211 91.2234 45.6208 3.7171 1.3701 0.7289 12.6010 15.9739 1.1338 3.3485 23.5358 8.8088 0.1759 5.1317 22.8386 7.3882 4.0424 3.6649 40.5077 7.2695 16.0187 5.7858 1.3762 0.4163
temp: 298.150 k
press: 1.00000 atm
elementType: 17 17 6 6 6 6 6 6 6 6 6 6 6 6 6 6 6 6 6 6 6 6 1 1 1 1 1 1 1 1 1 1 1 1 1 1
symmnumber: 1
zpe: 712174.5 jmol-1
zpe.correction: 0.271253 hartree
zpe.thermalcorrener: 0.289926 hartree
zpe.thermalcorrenthalpy: 0.290870 hartree
zpe.thermalcorrgfe: 0.221580 hartree
zpe.sumelectzpe: -1689.145119 hartree
zpe.sumelectthermal: -1689.126447 hartree
zpe.sumelectthermalent: -1689.125502 hartree
zpe.sumelectthermalfe: -1689.194792 hartree
dipole: -1.3510 -1.9348 0.0216
dipole: 2.3599
quadrupole: -150.7931 -137.9995 -139.1368
quadrupole: 6.9519 2.1315 1.9656
quadrupole: -8.1500 4.6437 3.5063 6.9519 2.1315 1.9656
hfenergy: -1689.4163722 hartree
pointgroup: C01 [X(C20H14Cl2)]
dipole: -0.6182699 0.6917688 0.0354148 debye
polarizability: 372.3736181|-17.5237408|279.4774923|-16.3194104|12.6295974|135.6162414 unknown
InChI: InChI=1S/C20H14Cl2/c21-18-10-6-16(7-11-18)20(14-15-4-2-1-3-5-15)17-8-12-19(22)13-9-17/h1-14H
charge 0 multiplicity 1
36 atoms
Cl 6.540277 0.380097 -0.237927
Cl -2.385288 -5.125297 -0.038366
C  0.395844 0.357167 0.043757
C  1.887753 0.351803 -0.043842
C  -0.295868 -0.971105 0.009537
C  -0.265038 1.559363 0.203392
C  -1.705578 1.877042 0.144051
C  2.592071 1.4265 -0.660052
C  -1.233603 -1.32747 1.01726
C  2.652326 -0.723979 0.491451
C  0.00125 -1.925086 -1.001752
C  -2.658429 1.120715 -0.602126
C  -2.162294 3.053126 0.809557
C  4.001112 1.446066 -0.718464
C  -1.871731 -2.585585 1.011329
C  4.061916 -0.720899 0.441862
C  -0.633785 -3.186173 -1.029003
C  4.71839 0.369838 -0.160692
C  -1.564672 -3.496619 -0.018841
C  -4.010825 1.513627 -0.652614
C  -3.517727 3.440059 0.767708
C  -4.451824 2.668853 0.037663
H  0.370358 2.435272 0.401883
H  2.030734 2.242466 -1.127654
H  -1.461666 -0.612662 1.814168
H  2.140122 -1.566304 0.96764
H  0.730463 -1.676811 -1.780403
H  -2.333306 0.236325 -1.157454
H  -1.441498 3.661047 1.370827
H  4.529647 2.272653 -1.202152
H  -2.588299 -2.852799 1.793244
H  4.637506 -1.547733 0.867824
H  -0.407282 -3.910011 -1.816955
H  -4.723818 0.92243 -1.238262
H  -3.843779 4.343052 1.29583
H  -5.504855 2.968535 -0.003223
