program: Gaussian 09
title: 000236012
version: EM64L-G09RevD.01
frameworkgroup: C1[X(C18H13NO2)]
method: RPBEPBE
basis: SDD
operation: Freq
keyword: #p
keyword: freq=noraman
keyword: PBEPBE/SDD
title: #p freq=noraman PBEPBE/SDD
converged: YES YES NO NO
title: Mulliken charges:
elementType: O O N C C C C C C C C C C C C C C C C C C H H H H H H H H H H H H H
charge: -0.278569 -0.198054 -0.002033 0.123985 -0.205821 -0.256134 0.415410 -0.223765 0.124312 -0.400510 -0.391366 0.299004 -0.205731 -0.228936 -0.234790 -0.343431 -0.339851 -0.236763 -0.251045 -0.225168 -0.218738 0.252637 0.277001 0.266170 0.246681 0.317117 0.228127 0.229947 0.238383 0.279299 0.229185 0.236006 0.238700 0.238742
chargesum: 0.00000
title: Mulliken charges with hydrogens summed into heavy atoms:
elementType: O O N C C C C C C C C C C C C C C C C C C
charge: -0.278569 -0.198054 -0.002033 0.123985 0.046816 0.020867 0.415410 0.042406 0.124312 -0.153828 -0.074248 0.299004 -0.205731 -0.000809 -0.004843 -0.105048 -0.060552 -0.007578 -0.015039 0.013532 0.020004
polarizability: 2.97472843e+02 -1.38606810e+00 2.04504785e+02 -3.19614841e+00 5.84752505e+00 1.00034322e+02
1716.lowfreq: -10.7189 -7.3501 -0.0006 0.0003 0.0004 2.3280 18.9126 35.8211 43.3407
frequency: 18.6309 35.8170 43.3201 47.0774 99.6399 104.8329 117.5552 129.2054 155.1034 181.7508 226.1896 257.4796 260.5028 312.2707 359.7278 389.3643 399.6718 403.7745 426.6104 436.6891 467.0514 518.0807 521.1625 556.4173 612.4933 614.1499 645.9002 662.1596 674.5719 696.4708 707.2535 724.1845 751.6536 768.5180 777.9791 787.3448 839.4359 858.1619 863.3829 896.1771 923.6607 934.1661 938.0220 947.8706 969.2679 988.3615 988.8415 989.1742 992.4047 1000.2246 1012.7375 1013.5957 1025.3755 1031.4184 1034.6640 1069.8635 1088.1275 1099.4470 1115.8293 1174.7895 1175.8875 1190.8194 1198.7692 1203.3364 1210.8696 1233.8247 1293.0929 1298.1616 1326.1917 1330.0793 1382.3981 1387.7521 1436.3945 1436.8964 1479.0470 1482.5396 1574.6497 1593.1303 1599.3069 1609.4191 1613.7700 1626.4559 2182.0362 2983.6742 3124.1029 3131.3024 3132.8592 3141.3237 3141.7856 3151.2920 3151.9767 3161.6559 3164.6961 3172.3735 3180.2397 3212.4317
redmass: 5.2542 4.0136 4.9695 6.1252 5.1937 8.6467 6.9591 6.1898 5.2522 6.2406 4.8951 6.4385 5.2008 6.5348 7.0672 4.5315 2.8606 2.9097 4.7243 6.4033 4.9628 4.0507 6.6249 5.5487 6.4349 6.4332 6.2043 5.2396 6.0001 1.6747 1.9303 1.8792 3.1689 2.0464 2.1989 5.0718 4.0104 1.2538 1.2530 4.3427 2.5186 1.5699 1.4317 1.6117 5.9667 2.8270 1.9033 5.2143 1.4055 2.5902 1.3422 1.3577 2.6934 2.1833 3.1217 3.1809 1.5756 1.8522 1.2676 1.0524 1.0656 1.1706 1.1270 1.8279 3.1125 2.5873 1.4622 1.5419 1.3207 1.3174 8.1312 8.9402 2.2546 2.2391 2.1843 2.1488 6.7206 6.1934 6.7946 5.7990 6.9158 7.3856 12.6865 1.0827 1.0854 1.0884 1.0853 1.0882 1.0924 1.0966 1.0924 1.0962 1.1016 1.1014 1.0874 1.1086
irintensity: 0.9051 0.4209 0.7807 1.0424 6.2960 2.1116 0.3725 1.2697 0.7001 2.0973 1.0195 4.8818 2.9611 5.7459 0.1950 2.2969 0.0887 0.2453 1.3976 0.7900 4.2737 3.3237 5.5327 2.8715 0.2400 0.7406 23.2045 6.2635 22.8365 61.6834 58.8740 37.3139 11.3792 44.4728 45.5401 0.4358 47.2885 0.8934 1.0132 8.4734 60.2968 30.1057 3.6133 26.8817 43.4476 0.3783 0.6757 0.7950 1.8135 73.2998 3.4012 1.5296 32.9082 4.6358 61.2242 23.8372 5.8503 15.5796 9.4370 0.0915 3.9186 30.2537 8.5436 23.4983 10.2844 178.7537 7.8379 13.7632 13.4091 5.8599 0.6188 2.6798 5.7651 35.5219 1.0619 21.3784 81.3163 3.1156 63.9940 1.2218 12.7950 14.8518 0.4159 44.6519 0.8867 16.6829 0.7645 4.2802 31.1260 12.9633 16.3335 16.7995 52.0415 20.9761 0.5388 1.9719
temp: 298.150 k
press: 1.00000 atm
elementType: 8 8 7 6 6 6 6 6 6 6 6 6 6 6 6 6 6 6 6 6 6 1 1 1 1 1 1 1 1 1 1 1 1 1
symmnumber: 1
zpe: 672302.2 jmol-1
zpe.correction: 0.256066 hartree
zpe.thermalcorrener: 0.273526 hartree
zpe.thermalcorrenthalpy: 0.274471 hartree
zpe.thermalcorrgfe: 0.208585 hartree
zpe.sumelectzpe: -897.411822 hartree
zpe.sumelectthermal: -897.394362 hartree
zpe.sumelectthermalent: -897.393418 hartree
zpe.sumelectthermalfe: -897.459303 hartree
dipole: -4.9485 -1.0641 3.6842
dipole: 6.2605
quadrupole: -92.8110 -125.4952 -126.0903
quadrupole: -12.2512 4.7624 6.8679
quadrupole: 21.9879 -10.6964 -11.2915 -12.2512 4.7624 6.8679
hfenergy: -897.667888 hartree
pointgroup: C01 [X(C18H13N1O2)]
dipole: -2.0500433 -0.576577 1.2375813 debye
polarizability: 296.8536542|-5.8766596|200.0262008|9.3225892|22.1766008|105.1320953 unknown
InChI: InChI=1S/C18H13NO2/c19-13-18(15-9-5-2-6-10-15)12-11-16(21-18)17(20)14-7-3-1-4-8-14/h1-12,16H
charge 0 multiplicity 1
34 atoms
O  0.627513 0.762348 -0.749126
O  -1.044565 -1.437378 -0.82218
N  2.838684 3.31543 -0.082561
C  1.687075 0.919349 0.293197
C  -0.704111 0.886036 -0.126763
C  0.895421 0.962642 1.607763
C  2.697279 -0.23824 0.219334
C  -0.43508 0.966111 1.36854
C  -1.581792 -0.350948 -0.47667
C  4.054999 -0.040629 0.568316
C  2.23783 -1.526964 -0.145351
C  -3.069746 -0.216367 -0.345414
C  2.345264 2.241856 0.081205
C  4.951793 -1.132516 0.562745
C  3.141815 -2.611679 -0.156571
C  -3.705846 0.9791 0.091857
C  -3.86991 -1.349312 -0.663598
C  4.49706 -2.421367 0.201968
C  -5.110994 1.035583 0.208437
C  -5.271568 -1.289224 -0.550556
C  -5.896484 -0.095472 -0.113556
H  -1.184094 1.804166 -0.520429
H  1.399564 0.995279 2.574653
H  -1.230456 0.989286 2.116381
H  4.419216 0.960324 0.828555
H  1.192509 -1.660653 -0.444151
H  6.002479 -0.973889 0.829432
H  2.787183 -3.605887 -0.450326
H  -3.120716 1.870254 0.341603
H  -3.363717 -2.261419 -0.996534
H  5.193925 -3.267039 0.191505
H  -5.593747 1.95918 0.545013
H  -5.879064 -2.165488 -0.800669
H  -6.987522 -0.047174 -0.026248
