program: Gaussian 09
title: 000236011
version: EM64L-G09RevD.01
frameworkgroup: C1[X(C12H10N2O5)]
method: RPBEPBE
basis: SDD
operation: Freq
keyword: #p
keyword: freq=noraman
keyword: PBEPBE/SDD
title: #p freq=noraman PBEPBE/SDD
converged: YES YES NO NO
title: Mulliken charges:
elementType: O O O O O N N C C C C C C C C C C C C H H H H H H H H H H
charge: -0.231921 -0.209341 -0.283817 -0.190912 -0.203981 -0.397149 0.023186 0.172809 0.377996 0.077321 0.117428 -0.532725 -0.348243 -0.337333 0.433485 -0.401564 0.185396 -0.258546 -0.667574 0.335886 0.290927 0.295727 0.299659 0.292579 0.228246 0.231697 0.246074 0.237642 0.217047
chargesum: 0.00000
title: Mulliken charges with hydrogens summed into heavy atoms:
elementType: O O O O O N N C C C C C C C C C C C C
charge: -0.231921 -0.209341 -0.283817 -0.190912 -0.203981 -0.061262 0.023186 0.172809 0.377996 0.077321 0.117428 -0.241798 -0.052515 -0.037674 0.433485 -0.108984 0.185396 0.201396 0.033189
polarizability: 2.88592814e+02 2.12969211e+00 1.73197486e+02 3.24074681e+00 2.67617864e+00 7.33035833e+01
1716.lowfreq: -6.1549 -0.0007 0.0003 0.0006 2.8867 4.6880 13.0345 35.6614 54.7567
frequency: 12.9826 35.6475 54.7512 62.7430 82.8557 85.6067 108.3799 166.4631 184.2088 213.8629 245.8677 254.7282 281.1993 298.4740 314.4160 368.2705 392.1130 416.7279 437.4986 490.5171 492.6261 498.7031 556.8612 566.5742 583.3904 639.9093 651.5278 660.1016 708.3348 712.1593 731.6027 742.7419 788.5711 807.2632 819.5827 827.5351 878.8209 900.5999 914.9673 915.0659 966.6556 1003.5207 1015.4879 1067.3368 1088.6586 1095.4072 1117.1784 1155.7525 1158.6801 1202.2787 1221.6784 1246.6995 1278.0974 1278.7898 1290.8204 1349.6954 1364.0097 1371.8514 1391.4468 1398.5757 1426.7519 1455.2017 1462.8184 1467.6188 1485.1195 1512.3640 1556.0086 1565.1304 1593.3966 1612.6443 1639.8825 2994.0777 3032.3144 3089.5865 3097.4685 3123.3604 3159.4416 3162.1644 3163.9896 3191.6302 3553.0787
redmass: 5.5155 4.3025 9.7865 7.2434 6.7637 4.3702 4.0851 5.4566 4.7404 1.4727 4.4692 5.4130 6.4329 4.5653 4.9701 7.0858 8.7321 3.2389 3.8741 4.0114 8.6283 7.3640 6.5367 4.7981 6.1534 1.3404 7.0899 4.6521 5.8447 4.6521 5.3024 8.9862 2.6104 3.9400 1.8787 3.5124 1.5989 5.2546 1.8257 3.5755 1.3770 2.6166 1.3415 2.7184 2.5862 2.1686 2.2829 1.7684 1.6800 4.1335 4.7666 1.4447 1.1282 2.7504 2.4084 1.6962 1.9912 6.1085 1.2359 4.6106 6.3604 1.1210 1.0456 3.2635 1.0523 2.9775 10.1503 6.8491 4.9398 7.4153 7.0292 1.0361 1.0599 1.0977 1.1022 1.1065 1.0924 1.0906 1.0941 1.0954 1.0784
irintensity: 2.2215 0.4358 0.1179 6.1502 5.7522 0.1338 0.3229 7.8826 2.3014 2.5556 3.5085 4.4366 0.6839 2.6828 17.0901 1.7217 9.7367 6.0458 4.4393 0.0801 3.0221 2.9126 0.1665 6.0529 5.5840 85.6670 2.6224 5.5986 30.2639 12.4173 12.6925 40.6917 6.7814 11.8058 6.1529 1.0689 13.9471 28.3337 40.2151 15.2904 8.4633 42.6399 0.0507 4.2541 220.5199 15.8310 183.8334 82.5930 0.8651 113.5170 191.5702 43.1713 2.6051 237.2313 32.7874 4.5569 15.0046 88.8549 22.8631 59.1031 11.5829 37.0953 17.0847 110.2781 15.3973 193.1489 70.2710 214.2356 67.2440 99.3520 140.6971 22.1689 34.5730 37.5759 4.1495 26.1218 6.5099 1.7787 3.4928 1.8793 75.7276
temp: 298.150 k
press: 1.00000 atm
elementType: 8 8 8 8 8 7 7 6 6 6 6 6 6 6 6 6 6 6 6 1 1 1 1 1 1 1 1 1 1
symmnumber: 1
zpe: 546160.6 jmol-1
zpe.correction: 0.208022 hartree
zpe.thermalcorrener: 0.224708 hartree
zpe.thermalcorrenthalpy: 0.225652 hartree
zpe.thermalcorrgfe: 0.161155 hartree
zpe.sumelectzpe: -947.479257 hartree
zpe.sumelectthermal: -947.462571 hartree
zpe.sumelectthermalent: -947.461627 hartree
zpe.sumelectthermalfe: -947.526124 hartree
dipole: -2.1243 3.0019 -0.0661
dipole: 3.6781
quadrupole: -132.5688 -103.3897 -108.4765
quadrupole: 4.4014 -0.0019 -0.4409
quadrupole: -17.7572 11.4220 6.3352 4.4014 -0.0019 -0.4409
hfenergy: -947.6872789 hartree
pointgroup: C01 [X(C12H10N2O5)]
dipole: 0.8731636 1.1230784 -0.265216 debye
polarizability: 288.2919249|-6.7516258|167.2346813|-3.1061713|-24.288957|79.5672769 unknown
InChI: InChI=1S/C12H10N2O5/c1-2-19-12(16)9-6-13-10-5-7(14(17)18)3-4-8(10)11(9)15/h3-6,13H,2H2,1H3
charge 0 multiplicity 1
29 atoms
O  3.809218 -0.686166 0.40215
O  1.333194 -1.95138 0.457581
O  3.878653 1.458233 -0.508726
O  -5.602983 -0.908315 0.300129
O  -5.261623 1.273009 -0.273244
N  -0.237967 1.796029 -0.455274
N  -4.836221 0.091989 0.031476
C  -0.584907 -0.532188 0.154271
C  -1.127982 0.746876 -0.172438
C  0.900821 -0.784775 0.199335
C  1.728625 0.40778 -0.092653
C  -2.526508 0.958739 -0.214726
C  -1.47798 -1.596865 0.438726
C  1.121205 1.61898 -0.412594
C  -3.365708 -0.127889 0.075369
C  -2.86758 -1.413447 0.404832
C  3.222955 0.455861 -0.103112
C  5.307432 -0.72558 0.397667
C  5.823289 -1.231623 -0.952189
H  -0.617653 2.713723 -0.6944
H  -2.968258 1.929026 -0.462688
H  -1.032412 -2.566337 0.682971
H  1.750354 2.483179 -0.647726
H  -3.56861 -2.222714 0.621412
H  5.540499 -1.422174 1.218036
H  5.690557 0.28452 0.625647
H  5.588184 -0.514883 -1.756896
H  5.375225 -2.209141 -1.198647
H  6.921679 -1.35287 -0.908389
