program: Gaussian 09
title: 000236010
version: EM64L-G09RevD.01
frameworkgroup: C1[X(C11H12O3)]
method: RPBEPBE
basis: SDD
operation: Freq
keyword: #pfreq=noraman
keyword: PBEPBE/SDD
title: #p freq=noraman PBEPBE/SDD
converged: YES YES NO NO
title: Mulliken charges:
elementType: O O O C C C C C C C C C C C H H H H H H H H H H H H
charge: -0.279255 -0.220932 -0.204917 0.310150 -0.309446 0.192757 0.373524 -0.659391 -0.673671 -0.379966 -0.380473 -0.220725 -0.221094 -0.239032 0.275919 0.235454 0.250694 0.222736 0.225694 0.227981 0.245852 0.264575 0.271895 0.229656 0.230745 0.231269
chargesum: 0.00000
title: Mulliken charges with hydrogens summed into heavy atoms:
elementType: O O O C C C C C C C C C C C
charge: -0.279255 -0.220932 -0.204917 0.310150 -0.033527 0.192757 0.373524 0.049493 0.025857 -0.115391 -0.108578 0.008932 0.009651 -0.007762
polarizability: 1.52517948e+02 -4.95326258e+00 1.29615837e+02 -8.78208294e+00 1.82746738e+00 7.85996635e+01
1716.lowfreq: -13.9481 -0.0004 0.0003 0.0006 3.5308 4.5582 33.3055 67.1606 83.7513
frequency: 33.1196 67.1273 83.7194 127.3000 164.8515 169.4657 217.3336 240.8498 288.5123 310.6229 349.8668 370.8409 403.4346 439.6584 480.9541 492.0190 556.2681 584.3903 614.1125 645.1188 666.3498 706.7574 723.5856 751.1788 799.2149 843.6426 864.4182 869.9531 929.1665 940.2129 950.5598 986.7801 988.1392 989.1258 991.2284 1002.2304 1030.0634 1065.8417 1095.7709 1162.3970 1173.0137 1190.7385 1197.7093 1208.3178 1225.5330 1259.6347 1272.8885 1321.9020 1380.5348 1386.2615 1398.0609 1435.0599 1450.4365 1452.8076 1468.8566 1473.3976 1480.3291 1591.6078 1611.2136 1702.0725 3001.8612 3009.4303 3014.1275 3103.5618 3111.3288 3112.6384 3122.6206 3126.6200 3136.0743 3148.5186 3158.1096 3168.2714
redmass: 3.9825 4.0999 4.2891 6.5010 2.5688 1.2247 1.0889 4.5992 3.6907 3.0469 3.3132 4.7259 2.8901 3.7873 4.0036 4.0142 6.1695 4.8390 6.4313 7.6414 6.1006 2.7441 2.5192 2.0340 5.7167 3.7833 1.2793 5.0948 1.5307 1.5054 2.0662 3.4729 1.6532 2.4815 1.8425 1.3362 2.1668 2.4938 1.9783 2.4639 1.0603 1.2608 2.3418 2.6531 1.5147 2.5355 1.4129 1.3084 7.9586 1.2886 1.2193 2.2213 1.0500 1.0476 1.0658 1.0506 2.1972 6.2415 5.8968 12.6234 1.0354 1.0359 1.0840 1.1001 1.1008 1.0995 1.1011 1.0849 1.0884 1.0931 1.0957 1.1009
irintensity: 1.5976 0.9275 0.3339 3.0631 1.2034 0.6915 0.2721 2.5706 1.5377 2.4384 0.4464 0.1351 0.1733 1.1779 8.6959 25.6212 15.8096 7.0601 0.4584 3.8565 2.4585 23.7297 18.7380 91.6411 44.1217 2.7276 4.2637 56.1151 0.7272 4.0960 9.6858 31.3741 11.9553 0.0372 4.5572 1.2590 5.1806 148.6762 56.9737 125.3444 0.4151 13.9470 17.3675 119.7982 13.0178 70.3675 12.7274 1.6907 0.0552 41.2058 31.6058 15.4091 4.3701 1.2842 0.5530 17.4589 22.8057 0.6657 6.5206 244.9350 5.9233 9.0726 7.7622 2.6345 16.5903 21.8428 17.2652 0.0549 9.2648 10.0840 18.8699 20.0299
temp: 298.150 k
press: 1.00000 atm
elementType: 8 8 8 6 6 6 6 6 6 6 6 6 6 6 1 1 1 1 1 1 1 1 1 1 1 1
symmnumber: 1
zpe: 537659.9 jmol-1
zpe.correction: 0.204784 hartree
zpe.thermalcorrener: 0.217556 hartree
zpe.thermalcorrenthalpy: 0.218500 hartree
zpe.thermalcorrgfe: 0.165256 hartree
zpe.sumelectzpe: -651.011788 hartree
zpe.sumelectthermal: -650.999016 hartree
zpe.sumelectthermalent: -650.998072 hartree
zpe.sumelectthermalfe: -651.051316 hartree
dipole: -0.2874 -3.4874 -0.0929
dipole: 3.5005
quadrupole: -71.8989 -86.2812 -83.6850
quadrupole: -6.0718 -2.3972 -4.3967
quadrupole: 8.7228 -5.6595 -3.0633 -6.0718 -2.3972 -4.3967
hfenergy: -651.2165722 hartree
pointgroup: C01 [X(C11H12O3)]
dipole: 0.014817 -1.3767255 0.0329629 debye
dipolederiv: -1.053359 0.0038522 -0.1268428 0.2219286 -0.4729162 0.0838299 -0.1752989 0.0197729 -0.4946232 -1.1052906 0.5892022 -0.0969627 0.358551 -0.9404347 0.0010388 -0.3444683 0.1299324 -0.3995483 -0.5860207 0.1486623 -0.0526761 0.2511513 -1.0640229 0.0012276 -0.0674682 -0.1195867 -0.33722 1.0864428 -0.1063393 0.00849 -0.2954903 0.929111 -0.116433 0.1666204 -0.051604 0.7215059 0.4919421 -0.1142356 -0.0842141 -0.4494993 0.0969189 -0.1791624 -0.1059249 -0.1167571 0.2056106 1.2806804 -0.6169381 0.2751188 -0.2866817 1.3699551 0.0478463 0.5948291 0.050922 0.3636044 0.1318816 0.1216719 -0.0406937 0.0890465 -0.038459 -0.0098338 -0.220006 -0.0894942 -0.0416844 -0.0784496 -0.0334739 0.0983525 0.0307694 -0.0813975 0.1006593 -0.0035774 0.1138931 -0.1883232 -0.2072679 0.0435653 0.0902748 0.0453895 -0.023489 0.0297131 0.1048603 -0.0156714 -0.0311917 -0.1385402 -0.1068441 -0.0452827 -0.0491856 -0.0407691 0.0198301 -0.0067567 0.049039 -0.1224476 -0.1867141 0.0276961 -0.0078924 -0.0171473 0.0241542 0.0004798 -0.0016977 0.0076244 -0.1278127 -0.0444211 0.0503028 -0.0395482 0.038909 0.1286038 -0.0022455 -0.0429145 -0.0023685 -0.1339305 0.0222165 -0.0847974 -0.086797 -0.0940878 0.0376775 0.0472407 -0.0646616 0.0554408 -0.1060879 0.032873 0.0454357 -0.096802 0.0543641 -0.0521772 -0.0165656 -0.0804609 -0.0168441 -0.1169801 -0.0399888 0.0090636 0.0175863 0.0423488 0.0469056 0.064329 0.0173767 0.0697977 -0.0263602 -0.0256621 -0.0242818 -0.112765 -0.0455284 0.09204 -0.0307726 -0.10243 -0.0026811 -0.0035604 -0.0564746 0.0278842 0.0818076 0.0472739 0.0622984 -0.0031584 0.1060081 -0.0004457 0.0644167 0.1211148 0.0047265 0.0058826 0.0398403 -0.1053017 -0.0223353 0.0043655 -0.0535892 0.0661717 -0.0261393 -0.0013241 -0.0703971 -0.0222026 0.1100731 -0.0227412 -0.1199347 -0.0229663 -0.0171903 0.0829216 -0.0113896 -0.0072071 0.0292338 -0.0927331 -0.0591042 0.0273977 -0.0517896 0.0982098 0.0893797 0.0025253 0.0206185 -0.0299247 0.0305587 0.1089397 0.0412996 0.0959782 -0.0208848 0.0772529 0.089048 0.0557526 0.091683 0.0395616 -0.0232447 0.0521936 -0.0287635 0.1232328 0.150396 -0.0427698 0.0213115 -0.0179323 -0.0096071 0.0049027 0.0066697 -0.0014003 0.1402868 0.0705978 -0.0399951 0.0275083 -0.0622929 -0.1137406 0.0029143 0.0313433 0.004029 0.1443095 -0.0141453 0.0807798 0.0704121 0.0944109 -0.0028632 -0.0496537 0.0823515 -0.0447543 0.1209338 -0.0752258 -0.0620274 0.0949656 -0.0649272 0.0700533 0.0222991 0.100284 0.0222863 0.1195632 unknown
polarizability: 150.9617655|-3.3905293|128.8823432|-15.5011086|-1.2524329|80.8893398 unknown
InChI: InChI=1S/C11H12O3/c1-11(2)13-9(10(12)14-11)8-6-4-3-5-7-8/h3-7,9H,1-2H3
charge 0 multiplicity 1
26 atoms
O  1.378579 -0.556313 -1.260743
O  2.273133 1.122818 0.148994
O  0.68163 2.791234 -0.167677
C  2.396734 -0.340292 -0.195534
C  0.357864 0.499969 -1.145328
C  1.0613 1.625586 -0.35077
C  -0.957046 0.025829 -0.510259
C  2.084732 -1.153122 1.062901
C  3.771173 -0.581206 -0.801679
C  -1.253724 -1.35748 -0.460226
C  -1.907682 0.965618 -0.038183
C  -2.487671 -1.799319 0.068114
C  -3.139682 0.518304 0.48963
C  -3.43427 -0.863655 0.544959
H  0.166634 0.865168 -2.171718
H  2.806732 -0.906268 1.859796
H  1.066222 -0.939333 1.426461
H  2.159582 -2.23045 0.835867
H  4.559249 -0.419218 -0.047568
H  3.833818 -1.621041 -1.165388
H  3.935801 0.101415 -1.650282
H  -0.515544 -2.073974 -0.83452
H  -1.682091 2.037061 -0.07434
H  -2.709646 -2.871837 0.103643
H  -3.867277 1.249844 0.858248
H  -4.390949 -1.207141 0.953999
