program: Gaussian 09
title: 000236005
version: EM64L-G09RevD.01
frameworkgroup: C1[X(C21H19Cl)]
method: RPBEPBE
basis: SDD
operation: Freq
keyword: #p
keyword: freq=noraman
keyword: PBEPBE/SDD
title: #p freq=noraman PBEPBE/SDD
converged: YES YES NO NO
title: Mulliken charges:
elementType: Cl C C C C C C C C C C C C C C C C C C C C C H H H H H H H H H H H H H H H H H H H
charge: -0.055317 0.029895 0.409232 0.389536 0.368219 -0.755636 -0.370280 -0.364940 -0.398613 -0.402932 -0.360349 -0.365079 -0.428981 -0.417716 0.436816 -0.247520 -0.251337 -0.251706 -0.253366 -0.245826 -0.244435 -0.809171 0.276585 0.289369 0.243320 0.256318 0.270449 0.261224 0.231649 0.255008 0.229440 0.228194 0.227714 0.224870 0.226325 0.226552 0.230228 0.227358 0.226354 0.225115 0.233432
chargesum: 0.00000
title: Mulliken charges with hydrogens summed into heavy atoms:
elementType: Cl C C C C C C C C C C C C C C C C C C C C C
charge: -0.055317 0.029895 0.409232 0.389536 0.368219 -0.189683 -0.126960 -0.108622 -0.128164 -0.141709 -0.128700 -0.110071 -0.199541 -0.189521 0.436816 -0.019805 -0.026467 -0.025381 -0.026814 -0.015598 -0.017076 -0.124270
polarizability: 2.57233664e+02 -4.83906168e+00 2.44222994e+02 7.24136105e+00 -2.32376054e+00 1.81685862e+02
1716.lowfreq: -5.1384 -0.0017 -0.0017 -0.0011 3.0021 7.2732 18.5132 41.3203 42.5786
frequency: 17.5366 41.2135 42.5365 46.9316 60.8623 70.0699 88.1736 105.7163 112.9979 165.5941 208.1572 223.6149 252.8060 260.1179 265.5683 286.8048 300.3610 350.3678 367.9986 401.0047 403.8245 412.2886 457.0153 497.4465 511.7141 560.5482 579.9788 613.6092 616.3975 622.7134 639.7186 655.3886 687.5253 704.6574 706.9539 729.4995 760.2099 766.3860 787.0367 810.1584 825.5243 851.1356 855.1657 857.5524 893.7491 927.3020 935.0855 960.5442 966.4909 977.1680 981.4911 983.0801 989.2422 991.0246 991.6646 996.7327 998.1177 1012.9585 1024.3702 1030.8970 1043.5005 1047.4844 1088.8675 1096.1853 1131.8364 1140.7351 1157.4368 1173.7677 1174.5757 1182.5751 1200.2504 1202.7828 1203.7757 1228.1169 1246.9343 1284.1359 1313.6939 1323.8636 1330.2091 1363.7857 1374.6654 1377.4357 1397.8242 1406.8168 1432.3563 1434.4365 1448.8874 1471.8267 1474.2529 1479.0882 1485.1710 1506.1897 1579.8376 1587.3995 1589.9575 1606.3004 1611.6821 1625.1243 2973.8666 3054.9276 3067.6546 3084.7431 3111.2347 3120.6867 3121.7896 3122.0243 3128.9435 3130.0913 3135.5450 3142.0090 3143.0138 3150.0462 3155.9404 3156.4175 3163.3432 3166.8360 3166.9994
redmass: 4.1803 1.7892 1.7339 3.2018 4.7214 4.7694 4.1528 6.9461 6.8599 4.4670 4.2278 4.6726 5.2310 5.1445 4.4557 3.2582 4.7477 3.3002 3.0593 2.8224 2.8387 2.9168 3.8130 3.8764 3.2551 3.7196 3.9674 6.0377 6.3280 5.9003 6.8671 5.1771 5.7761 1.7846 1.6148 3.2560 2.1153 2.2812 2.6247 2.2669 1.7832 1.2610 1.2540 1.2542 2.8648 1.4233 1.6942 1.3630 2.2474 1.4080 1.4559 1.4327 1.5411 4.2092 4.3605 1.3406 1.3473 3.3356 3.1229 2.3682 2.5161 1.5604 1.6243 1.7360 1.3506 1.9627 2.1433 1.0569 1.0616 3.4133 1.1373 1.1483 1.1248 2.7094 2.1325 1.1730 1.3224 1.3476 1.3482 5.1781 6.9450 7.1784 1.2262 3.0798 2.1508 2.1834 1.1351 1.0963 1.0537 2.0912 2.1488 2.5421 5.9059 5.9881 5.9948 5.9827 5.9098 6.3696 1.0388 1.0946 1.0566 1.0997 1.0865 1.0895 1.0850 1.0847 1.0879 1.0880 1.0961 1.0942 1.0935 1.1084 1.0957 1.0956 1.0938 1.0996 1.0997
irintensity: 0.1654 0.2303 0.2516 0.5712 0.2250 0.4085 0.2325 0.6163 0.9287 0.1453 0.9774 1.9047 2.6365 0.2510 0.3125 1.0162 0.6471 1.4827 0.4624 0.0594 0.2609 0.1281 0.8075 3.3361 6.6614 12.1867 20.7233 16.8552 0.0418 38.4444 1.1532 6.8745 24.5905 45.5960 69.0196 3.5300 38.3756 20.6400 13.2114 10.3274 15.6255 0.5897 0.3945 0.4037 5.8664 1.9312 3.8275 0.1081 9.4804 0.1581 0.4421 0.1527 2.3288 2.1389 0.6170 0.1738 0.3609 5.7909 6.5319 11.5671 2.2623 16.8218 1.0581 13.3500 6.3278 0.7006 0.8860 0.0505 0.3270 2.8592 6.6052 5.4893 0.3084 0.4577 7.6945 6.9345 0.6431 1.1114 1.0976 1.1976 1.8627 0.1150 10.3212 1.1694 1.9098 12.7027 21.2879 14.9167 12.9247 28.9034 18.1591 43.0659 1.3679 1.2971 0.8025 8.5660 5.4519 2.0226 41.8746 22.7504 15.7800 17.4369 18.3142 22.6133 3.3426 2.7350 2.9399 5.5333 21.9050 15.1195 33.7114 13.5260 19.4603 27.1393 4.8264 26.8592 12.3609
temp: 298.150 k
press: 1.00000 atm
elementType: 17 6 6 6 6 6 6 6 6 6 6 6 6 6 6 6 6 6 6 6 6 6 1 1 1 1 1 1 1 1 1 1 1 1 1 1 1 1 1 1 1
symmnumber: 1
zpe: 869449.9 jmol-1
zpe.correction: 0.331156 hartree
zpe.thermalcorrener: 0.350736 hartree
zpe.thermalcorrenthalpy: 0.351680 hartree
zpe.thermalcorrgfe: 0.281013 hartree
zpe.sumelectzpe: -1270.155200 hartree
zpe.sumelectthermal: -1270.135620 hartree
zpe.sumelectthermalent: -1270.134676 hartree
zpe.sumelectthermalfe: -1270.205343 hartree
dipole: 0.7519 1.6335 -1.3865
dipole: 2.2707
quadrupole: -124.4911 -128.0505 -135.5687
quadrupole: -3.5939 6.0531 3.3849
quadrupole: 4.8790 1.3196 -6.1986 -3.5939 6.0531 3.3849
hfenergy: -1270.486356 hartree
pointgroup: C01 [X(C21H19Cl1)]
dipole: 0.2354297 -0.5399823 0.6716522 debye
polarizability: 258.2257352|3.2323571|240.7510122|-4.9562269|-13.3725835|184.1657728 unknown
InChI: InChI=1S/C21H19Cl/c1-17-12-14-20(15-13-17)21(16-22,18-8-4-2-5-9-18)19-10-6-3-7-11-19/h2-15H,16H2,1H3
charge 0 multiplicity 1
41 atoms
Cl -0.685709 1.030142 -3.182587
C  0.27325 -0.082861 -0.665454
C  -1.22171 -0.023642 -0.251511
C  1.00534 -1.352935 -0.106769
C  1.075951 1.141881 -0.151069
C  0.329074 -0.249184 -2.214319
C  -2.085879 -1.107577 -0.56354
C  -1.798624 1.120951 0.346736
C  0.437777 -2.200379 0.877384
C  1.625745 2.129777 -1.004157
C  2.329035 -1.633812 -0.54556
C  1.299159 1.265383 1.247707
C  -3.463136 -1.053778 -0.273086
C  -3.180073 1.17318 0.639201
C  -4.039369 0.087973 0.341907
C  1.15745 -3.305794 1.387418
C  2.381455 3.204368 -0.476538
C  3.044865 -2.741882 -0.046815
C  2.045335 2.337474 1.776783
C  2.459784 -3.589844 0.922011
C  2.594689 3.315666 0.913928
C  -5.519164 0.137707 0.680001
H  1.346698 -0.153579 -2.617343
H  -0.107662 -1.211185 -2.514864
H  -1.683746 -2.006208 -1.046946
H  -1.173177 1.988761 0.574545
H  -0.567337 -1.995478 1.256688
H  1.453953 2.087633 -2.083371
H  2.824687 -0.963212 -1.256873
H  0.89363 0.505462 1.925193
H  -4.102207 -1.906946 -0.532295
H  -3.596431 2.079893 1.095384
H  0.697281 -3.941446 2.152554
H  2.796137 3.956639 -1.157287
H  4.062712 -2.935289 -0.403833
H  2.204309 2.40693 2.858848
H  3.015021 -4.448579 1.315305
H  3.179712 4.14824 1.320513
H  -5.904672 1.172159 0.653442
H  -6.116319 -0.468031 -0.024372
H  -5.710036 -0.257776 1.696943
