program: Gaussian 09
title: 000236004
version: EM64L-G09RevD.01
frameworkgroup: C1[X(C16H20O)]
method: RPBEPBE
basis: SDD
operation: Freq
keyword: #pfreq=noraman
keyword: PBEPBE/SDD
title: #p freq=noraman PBEPBE/SDD
converged: YES YES NO NO
title: Mulliken charges:
elementType: O C C C C C C C C C C C C C C C C H H H H H H H H H H H H H H H H H H H H
charge: -0.288003 0.363521 -0.102047 0.358750 -0.682582 -0.389559 -0.587427 -0.382677 0.570963 -0.243168 -0.812460 -0.037483 -0.329186 -0.766310 -0.050312 -0.601828 -0.558032 0.218769 0.244006 0.241710 0.213489 0.251441 0.247860 0.224412 0.221766 0.225723 0.241777 0.232668 0.212033 0.211297 0.220586 0.220110 0.235598 0.215488 0.218238 0.221655 0.219210
chargesum: 0.00000
title: Mulliken charges with hydrogens summed into heavy atoms:
elementType: O C C C C C C C C C C C C C C C C
charge: -0.288003 0.363521 -0.102047 0.358750 -0.219806 -0.138118 -0.132228 -0.134817 0.570963 -0.018756 -0.123194 0.195186 0.094145 -0.325614 0.185286 -0.168101 -0.117168
polarizability: 2.30948498e+02 1.01080342e+01 1.88791247e+02 -1.23160087e+01 7.57273450e+00 1.17318038e+02
1716.lowfreq: -9.8661 -4.5277 -0.0002 0.0002 0.0004 2.5918 22.2758 26.0460 36.6592
frequency: 21.6506 26.0012 35.5886 50.6351 58.0705 67.2058 76.1093 102.2167 110.4495 140.4846 166.6942 186.6989 212.2406 258.1728 264.6922 290.2216 323.1225 376.1134 395.9122 412.4018 418.4620 454.1236 490.2841 523.9205 536.7051 554.2759 587.9645 623.4751 656.4416 697.3964 725.5819 780.8422 799.8101 808.8942 829.0446 893.3699 900.6798 904.6584 924.1595 934.4109 943.1169 943.3113 946.3531 958.6011 964.5841 971.7876 985.2007 992.5961 1010.3873 1016.1953 1026.2923 1049.4365 1071.0833 1114.6930 1146.8018 1149.8624 1175.2850 1189.7340 1211.0183 1214.5800 1248.9268 1253.9523 1280.1929 1280.4948 1291.1989 1294.0836 1296.5427 1346.2395 1372.9767 1393.3363 1423.7660 1428.0688 1430.0136 1441.4084 1450.0737 1455.6930 1461.0903 1469.2279 1476.3643 1480.3909 1592.6432 1595.9042 1655.2407 1664.9453 1668.6836 2947.2991 2965.2696 2969.3428 2975.6834 3010.7273 3019.5165 3032.1115 3045.7567 3082.0601 3085.6265 3087.7862 3091.4086 3095.2631 3117.6896 3120.4663 3131.8300 3153.9302 3188.2962 3194.7758 3201.7034
redmass: 3.5753 3.8585 2.4364 2.7799 2.7578 2.9014 2.8398 3.4128 3.1296 2.9249 1.1784 2.4704 3.5635 3.3757 3.1767 4.2724 3.7682 2.1859 2.1661 2.4030 2.6635 2.7947 3.0156 2.4589 4.2814 2.6469 2.4521 1.9728 2.1703 2.0383 1.8410 1.7327 3.1055 2.8627 3.1688 2.6101 2.1113 1.4790 1.5928 1.4807 1.3484 1.4596 1.7732 1.5189 1.7410 1.7208 1.3367 2.0223 1.2439 1.1742 1.5744 1.5688 2.2166 1.7010 1.7036 2.9280 1.2086 1.2089 1.2499 1.3357 3.0546 1.6855 1.3410 1.3157 1.8099 1.5339 1.7093 1.2805 5.3160 1.2370 1.1968 1.1841 1.3674 2.2111 1.6232 1.0729 1.2728 1.1830 1.0784 1.0862 6.0218 7.5501 4.7048 4.7816 4.9660 1.0582 1.0599 1.0374 1.0590 1.1036 1.0980 1.0999 1.0962 1.0633 1.0645 1.0974 1.0604 1.0904 1.0945 1.0858 1.0914 1.0989 1.1138 1.1142 1.1144
irintensity: 0.0165 0.0761 1.5454 0.5266 0.0058 0.4111 0.7609 1.1491 0.7085 0.7160 0.7615 1.1629 0.3562 2.6391 3.4899 11.9083 5.3792 2.0819 4.2788 2.1953 4.2365 2.8589 3.6215 0.6126 2.4764 4.2450 9.2026 7.7210 5.8793 2.9494 0.2519 21.7453 10.1548 30.2214 1.6855 0.1067 33.3453 18.4014 5.7283 16.9848 26.8295 57.6999 175.8535 43.8191 11.5278 10.8135 1.6618 1.2685 13.5228 17.2266 16.3800 0.8528 45.6854 2.0694 1.6965 78.1604 1.3609 5.4530 4.7834 11.3238 24.7864 8.4074 4.2802 2.4147 5.8108 6.7693 25.1332 9.5944 0.2086 25.6010 4.6890 0.5496 44.3884 27.6861 10.1297 5.6137 21.0122 7.1263 14.8408 7.3928 2.6427 8.2816 23.0964 2.8391 35.1973 32.2396 26.2595 26.1418 17.1329 34.9173 7.4890 9.5790 20.3913 16.6036 16.8053 26.7367 10.6881 8.5959 8.1976 0.6773 10.1956 26.7207 26.6560 29.1460 25.3210
temp: 298.150 k
press: 1.00000 atm
elementType: 8 6 6 6 6 6 6 6 6 6 6 6 6 6 6 6 6 1 1 1 1 1 1 1 1 1 1 1 1 1 1 1 1 1 1 1 1
symmnumber: 1
zpe: 813269.9 jmol-1
zpe.correction: 0.309758 hartree
zpe.thermalcorrener: 0.328450 hartree
zpe.thermalcorrenthalpy: 0.329394 hartree
zpe.thermalcorrgfe: 0.260027 hartree
zpe.sumelectzpe: -695.579998 hartree
zpe.sumelectthermal: -695.561306 hartree
zpe.sumelectthermalent: -695.560362 hartree
zpe.sumelectthermalfe: -695.629729 hartree
dipole: -0.4787 0.7244 -1.0624
dipole: 1.3721
quadrupole: -101.0671 -95.7838 -102.7259
quadrupole: -0.1181 -0.4471 -2.5080
quadrupole: -1.2082 4.0751 -2.8669 -0.1181 -0.4471 -2.5080
hfenergy: -695.8897558 hartree
pointgroup: C01 [X(C16H20O1)]
dipole: 0.1319078 0.2113538 0.4789016 debye
polarizability: 231.786209|4.9898486|187.4327512|-15.3900024|7.067485|117.8388238 unknown
InChI: InChI=1S/C16H20O/c1-5-8-14-9-7-10-15(12-13(3)4)16(14)17-11-6-2/h5-7,9-10H,1-3,8,11-12H2,4H3
charge 0 multiplicity 1
37 atoms
O  -0.165178 1.490891 -0.153844
C  -0.842282 -0.847014 0.151957
C  0.191813 0.11658 0.005801
C  1.565169 -0.249279 -0.053669
C  -2.312193 -0.424286 0.201581
C  -0.472171 -2.210894 0.25727
C  2.650383 0.81329 -0.234735
C  1.894071 -1.622287 0.057353
C  -3.233396 -1.269205 -0.676215
C  0.884602 -2.596912 0.217097
C  -2.952937 -1.229405 -2.1673
C  3.790636 0.375264 -1.133093
C  -0.20571 2.255783 1.12554
C  -4.256087 -1.991588 -0.145559
C  -0.451608 3.701018 0.786626
C  5.103415 0.386395 -0.790353
C  -1.415639 4.463426 1.3580
H  -2.673847 -0.473151 1.247988
H  -2.372282 0.634578 -0.117111
H  2.170475 1.717263 -0.659138
H  3.065104 1.105711 0.751727
H  -1.261776 -2.964936 0.359554
H  2.948251 -1.919075 0.00761
H  1.155403 -3.655255 0.302054
H  -3.666577 -1.850657 -2.734735
H  -3.013052 -0.190937 -2.548062
H  -1.928199 -1.586594 -2.384865
H  3.498224 0.039644 -2.139944
H  -1.002669 1.851574 1.78141
H  0.769921 2.129367 1.642188
H  -4.450431 -2.007753 0.933949
H  -4.9323 -2.580213 -0.776557
H  0.225814 4.129572 0.035237
H  5.884175 0.080195 -1.495513
H  5.434393 0.706746 0.205917
H  -1.533991 5.522272 1.103828
H  -2.112928 4.052273 2.098705
