program: Gaussian 09
title: 000236000
version: EM64L-G09RevD.01
frameworkgroup: C1[X(C13H11Br)]
method: RPBEPBE
basis: SDD
operation: Freq
keyword: #p
keyword: freq=noraman
keyword: PBEPBE/SDD
title: #p freq=noraman PBEPBE/SDD
converged: NO YES NO NO
title: Mulliken charges:
elementType: Br C C C C C C C C C C C C C H H H H H H H H H H H
charge: 0.001849 -0.737897 0.510625 0.495433 -0.374530 -0.374571 -0.381169 -0.381188 -0.183831 -0.183821 -0.226892 -0.226893 -0.214456 -0.240279 0.219195 0.219195 0.231037 0.231041 0.221340 0.221339 0.247854 0.247853 0.224907 0.224906 0.228951
chargesum: 0.00000
title: Mulliken charges with hydrogens summed into heavy atoms:
elementType: Br C C C C C C C C C C C C C
charge: 0.001849 -0.299507 0.510625 0.495433 -0.143493 -0.143530 -0.159828 -0.159848 0.064023 0.064032 -0.001985 -0.001986 -0.214456 -0.011328
polarizability: 2.02921771e+02 -1.10336429e-02 1.41757482e+02 -1.05644468e+00 -2.26898283e-02 9.98209903e+01
1716.lowfreq: -19.7816 -2.2832 0.0002 0.0004 0.0005 2.5679 11.6450 34.4474 38.9098
frequency: -19.5935 34.4453 38.2089 103.9243 180.4906 192.9226 267.8513 286.0042 325.8754 370.8838 400.7090 405.2845 469.3882 480.5687 569.7824 616.5895 617.0718 626.5142 699.6902 714.6820 745.5793 789.1589 808.4726 828.7389 849.5674 852.1585 920.0284 920.1553 953.2931 966.5780 974.1882 989.6916 993.7591 994.5956 1025.8756 1060.1879 1073.7216 1107.7385 1152.3499 1172.8010 1185.0446 1187.7077 1193.9844 1210.3256 1291.1635 1295.5650 1324.8493 1369.8279 1380.9238 1391.6231 1439.8183 1468.2245 1474.8875 1483.9128 1580.0752 1593.8484 1594.1691 1611.8688 2993.5259 3048.5051 3115.3350 3115.4223 3128.8428 3130.4205 3132.4216 3143.7802 3162.2947 3163.2300 3166.6479
redmass: 3.6472 7.6930 3.9852 6.5972 5.9026 5.5567 7.7008 3.9181 6.3288 1.9017 2.7925 2.8521 3.9263 3.1398 4.7314 6.4602 3.9804 6.6048 2.0894 2.6558 2.4658 2.0041 4.1326 1.2506 1.2504 1.9339 1.5070 1.7674 1.3957 1.3819 1.3882 6.1779 1.3207 5.0485 2.2427 2.6254 1.5868 1.3744 1.0916 1.0508 1.1090 1.2304 2.5203 2.5824 1.4630 1.2692 1.2942 6.9631 7.5348 2.7626 2.1714 1.9081 1.4738 1.7563 7.2409 6.0372 6.2979 6.1816 1.0597 1.1025 1.0882 1.0858 1.0894 1.0894 1.0906 1.0958 1.1015 1.0952 1.0963
irintensity: 0.0001 0.0165 0.0502 0.1661 0.0123 0.3112 2.7409 0.0865 3.9740 0.0171 0.0005 0.0201 14.6812 16.1378 15.7009 0.1312 14.8849 0.2848 36.5198 17.4929 72.4061 24.6396 2.9537 0.1356 0.2227 32.0348 2.9630 0.3255 0.1674 0.1496 0.3614 2.4967 0.4964 53.6909 6.9198 28.5232 3.9105 16.3528 0.1577 0.0624 0.0540 1.5318 1.2749 3.9710 3.8002 0.1100 0.7200 0.1034 0.7195 6.5830 7.2321 81.4365 39.1157 2.8691 0.0296 1.7179 5.4794 12.1859 34.6506 10.4257 2.9174 14.6245 8.2033 17.1365 8.6214 44.0402 23.2938 12.2448 0.0579
temp: 298.150 k
press: 1.00000 atm
elementType: 35 6 6 6 6 6 6 6 6 6 6 6 6 6 1 1 1 1 1 1 1 1 1 1 1
symmnumber: 1
zpe: 514141.6 jmol-1
zpe.correction: 0.195826 hartree
zpe.thermalcorrener: 0.206958 hartree
zpe.thermalcorrenthalpy: 0.207903 hartree
zpe.thermalcorrgfe: 0.156361 hartree
zpe.sumelectzpe: -514.469055 hartree
zpe.sumelectthermal: -514.457923 hartree
zpe.sumelectthermalent: -514.456979 hartree
zpe.sumelectthermalfe: -514.508520 hartree
dipole: 2.2426 0.0005 0.7993
dipole: 2.3808
quadrupole: -95.9897 -79.5606 -92.2094
quadrupole: -0.0030 -2.7251 -0.0065
quadrupole: -6.7365 9.6926 -2.9562 -0.0030 -2.7251 -0.0065
hfenergy: -514.6648815 hartree
pointgroup: C01 [X(C13H11Br1)]
dipole: -0.8348635 -0.0007256 -0.4246845 debye
dipolederiv: -0.6483169 -0.0004911 -0.2734798 -0.0004772 -0.0747686 -0.0001899 -0.3291727 -0.0002927 -0.1965503 -0.1527432 0.000024 0.0274495 0.0000406 0.1519888 0.0000709 0.0598668 0.0000671 0.189083 0.3878262 0.0001695 0.1092023 0.0002853 -0.0568622 -0.0000498 0.2348922 -0.0000274 -0.0721976 0.3059435 -0.0002649 -0.169874 -0.0004746 -0.0322288 -0.0000376 -0.3457733 0.0000202 -0.0111527 -0.1247921 0.0500535 0.065443 0.0141382 0.054542 0.0092458 0.0216149 0.0037446 -0.1150648 -0.1248388 -0.0496987 0.0656587 -0.0139717 0.0544971 -0.0099271 0.0216635 -0.004364 -0.1149844 -0.2085342 0.0559852 -0.0384521 0.0756186 0.0420154 -0.0655588 0.0164391 -0.0229102 -0.1269076 -0.2084802 -0.056119 -0.0382567 -0.075589 0.042359 0.0651488 0.0166045 0.0223795 -0.1271905 -0.319983 -0.0878641 -0.1083472 -0.0331201 0.0387618 -0.0123494 -0.1267578 -0.0502125 -0.1433604 -0.3199115 0.0875138 -0.1086156 0.0326595 0.0389991 0.0117438 -0.126848 0.0495644 -0.1435493 -0.0477986 -0.0496455 -0.0706214 -0.0660648 0.1002641 0.0443389 -0.0750639 0.0423795 -0.0771015 -0.0478294 0.0494408 -0.0707846 0.0658247 0.1002183 -0.0447864 -0.0752501 -0.0429717 -0.0768172 1.0269496 0.0010221 0.5781313 0.0009867 0.0148059 0.0002544 0.6345383 0.0003553 0.1900574 -0.0467193 -0.0001645 -0.1338544 -0.0000707 -0.0887182 -0.0000161 -0.1062519 0.0000275 -0.0545573 0.0109193 -0.0025364 -0.0032873 -0.0152688 -0.0578411 -0.152578 -0.0050347 -0.0442017 -0.004155 0.0109174 0.0025208 -0.0032706 0.0152708 -0.0571581 0.1527542 -0.0050694 0.0443808 -0.0048323 0.0427516 -0.0976031 -0.0734369 -0.09105 -0.0354941 -0.0342185 -0.0645057 -0.0370101 0.1033055 0.0427366 0.0973009 -0.0738147 0.090858 -0.0352443 0.0347929 -0.064841 0.0375448 0.1030178 0.0896914 -0.0965292 0.0699958 -0.0910274 -0.0521368 0.0543865 0.0573179 0.0637642 0.0819971 0.0897075 0.0967692 0.0697111 0.0911843 -0.0525691 -0.0540049 0.057026 -0.0633506 0.0823451 0.0673693 0.0630594 -0.041039 0.0685882 -0.0161285 0.0308171 -0.0535656 0.03395 0.1352779 0.0673839 -0.063286 -0.0408151 -0.0687423 -0.0164328 -0.0302692 -0.0533065 -0.0334015 0.1355087 0.0661014 0.0675753 0.0603485 0.0905746 -0.0756198 -0.0585169 0.0782552 -0.0545226 0.1029959 0.0660566 -0.0674431 0.0605335 -0.090419 -0.0753696 0.059028 0.0785781 0.055143 0.1026618 -0.0244072 0.0002113 0.1414756 0.000246 0.0881203 -0.0000786 0.1546442 -0.0000557 0.0421708 unknown
polarizability: 201.5041188|0.0321108|141.7573755|12.0526524|-0.0695075|101.2387487 unknown
InChI: InChI=1S/C13H11Br/c14-13-8-6-12(7-9-13)10-11-4-2-1-3-5-11/h1-9H,10H2
charge 0 multiplicity 1
25 atoms
Br 5.01563 0.002428 1.416065
C  -0.532779 -0.00277 -1.627924
C  0.818486 -0.001525 -0.910216
C  -1.723094 -0.00116 -0.663925
C  1.455819 -1.217755 -0.556222
C  1.456031 1.215903 -0.560741
C  -2.277686 1.218864 -0.19954
C  -2.277825 -1.219623 -0.195624
C  2.690961 -1.228201 0.130264
C  2.691172 1.228667 0.125708
C  -3.355135 1.223042 0.715165
C  -3.355271 -1.220737 0.719094
C  3.29515 0.000805 0.465129
C  -3.896964 0.001925 1.179483
H  -0.595337 -0.89175 -2.283366
H  -0.595374 0.883961 -2.286401
H  0.987446 -2.173759 -0.818523
H  0.987835 2.171007 -0.826607
H  -1.865863 2.17108 -0.557155
H  -1.866121 -2.173033 -0.550181
H  3.171804 -2.174849 0.394747
H  3.172187 2.176201 0.386683
H  -3.772962 2.175052 1.062362
H  -3.773201 -2.17158 1.069357
H  -4.733812 0.003108 1.886871
