program: Gaussian 09
title: 000235981
version: EM64L-G09RevD.01
frameworkgroup: C1[X(C16H23NO2)]
method: RPBEPBE
basis: SDD
operation: Freq
keyword: #p
keyword: freq=noraman
keyword: PBEPBE/SDD
title: #p freq=noraman PBEPBE/SDD
converged: YES YES NO NO
title: Mulliken charges:
elementType: O O N C C C C C C C C C C C C C C C C H H H H H H H H H H H H H H H H H H H H H H H
charge: -0.261843 -0.272260 -0.626072 0.372193 0.548538 -0.517939 -0.550489 -0.609960 0.025173 0.200292 -0.372013 -0.624452 -0.361835 -0.692952 -0.685123 0.121418 -0.331030 -0.058466 -0.559957 0.230129 0.193903 0.203033 0.201349 0.246941 0.219053 0.203453 0.258759 0.205698 0.211891 0.216777 0.217434 0.208144 0.210165 0.211497 0.220471 0.202790 0.270541 0.330622 0.328510 0.222123 0.218057 0.225436
chargesum: 0.00000
title: Mulliken charges with hydrogens summed into heavy atoms:
elementType: O O N C C C C C C C C C C C C C C C C
charge: -0.261843 -0.272260 0.033061 0.372193 0.548538 -0.093907 -0.146107 -0.363018 0.025173 0.200292 0.050493 -0.365693 0.055755 -0.050598 -0.042990 0.121418 0.142302 0.163658 -0.116464
polarizability: 2.63595974e+02 3.23748485e+00 2.03925764e+02 3.23999633e+00 -5.09958923e+00 1.23424910e+02
1716.lowfreq: -21.5833 -9.1940 -5.3093 -0.0008 -0.0008 0.0004 5.3589 26.0305 40.6179
frequency: -18.9061 25.9814 40.5349 52.2464 60.4548 69.1815 75.3603 79.4630 85.9586 118.4075 134.1574 148.2843 177.3381 191.0588 223.1909 234.4583 254.5749 259.8728 278.8083 279.8505 287.4359 319.2717 363.1871 396.0625 413.7387 426.9645 506.4171 512.8602 518.2482 549.2029 599.1914 601.5819 623.9213 638.4349 654.1491 731.6069 739.5654 744.8505 760.8292 780.6011 856.8084 866.0087 873.5779 877.2574 909.4877 915.2039 919.7214 923.5767 952.8861 964.2086 978.1793 989.5365 1011.3690 1047.6135 1049.4674 1054.4824 1069.4883 1086.5839 1094.3244 1095.6314 1141.1267 1146.3298 1206.1898 1216.7726 1221.1979 1223.0420 1239.2942 1262.9440 1278.5286 1280.3774 1283.3299 1284.2281 1288.7774 1331.1991 1335.3716 1338.5115 1342.8343 1387.8019 1390.1295 1392.9393 1411.9164 1430.3034 1447.1637 1465.7957 1468.2043 1469.7828 1473.2673 1475.9493 1476.1128 1478.1667 1485.4440 1488.3237 1572.7505 1579.4254 1609.2207 1621.5664 1661.8451 2951.0187 2969.2955 2971.2788 2973.3496 2979.9389 2980.6160 2988.4986 3012.4421 3028.9877 3039.2705 3055.1990 3070.1477 3070.5460 3070.5798 3073.7481 3074.2918 3091.2890 3109.2374 3112.6159 3118.6573 3202.1480 3517.6558 3675.6905
redmass: 2.6179 4.2727 3.4531 3.8450 3.7722 2.2435 2.1187 2.1242 2.6279 3.1278 3.4285 3.9473 5.0363 4.7165 1.1740 1.1259 3.5716 2.5856 4.0097 3.0153 2.6294 3.0956 3.2240 4.5127 6.1063 2.4444 1.6901 1.8490 2.7427 2.2419 2.1784 2.4664 2.1909 4.3228 2.5930 3.9304 1.2226 1.1756 3.4812 4.5397 1.4736 1.5358 1.6394 1.6506 1.5355 1.7054 3.2444 1.5061 2.0299 1.7365 2.6209 2.2313 1.3536 2.3949 2.8201 2.2161 1.4618 1.4472 2.1317 2.1250 1.8265 2.2654 1.7195 1.5508 1.3940 1.4628 1.7084 1.4987 1.3826 1.1664 1.2302 1.2199 1.5050 1.9553 1.5165 1.3511 2.5989 1.2203 1.2421 6.0324 3.0108 1.2848 2.3887 1.1290 1.0794 1.1693 1.0683 1.0589 1.0599 1.0480 1.0787 1.0856 2.3459 5.6243 3.5231 2.7150 4.7528 1.0651 1.0570 1.0356 1.0376 1.0601 1.0596 1.0631 1.0998 1.0972 1.1034 1.1013 1.0995 1.1009 1.0965 1.0993 1.1018 1.0605 1.0911 1.0946 1.0910 1.1148 1.0444 1.1046
irintensity: 0.0387 0.2227 0.0279 1.9615 3.6714 2.1705 1.1247 0.7616 0.3754 3.1365 4.1172 3.2509 3.2975 0.2454 0.1103 0.1290 2.3818 0.3052 0.6671 0.6471 0.6651 5.2486 2.6324 1.8840 3.2100 1.4221 93.6509 71.4173 22.7161 19.2999 18.1368 11.6050 50.5791 0.7699 11.0419 3.7541 9.0865 2.9987 3.3357 15.9598 5.0703 11.4099 7.9020 0.3174 9.4145 5.4780 5.3232 1.2359 135.2985 44.8197 20.0586 5.1598 12.9907 1.7009 0.2774 1.0374 0.9040 3.9065 15.5331 20.8387 15.2890 96.5925 75.5124 27.2996 10.2934 67.4474 9.9079 20.2642 6.5471 0.3198 0.8504 6.5698 26.8662 94.8912 15.8308 17.0716 88.2168 12.6929 9.6280 26.1894 33.2013 24.8560 77.9994 21.2170 1.7489 6.2182 4.7893 4.9663 4.0619 11.9842 16.9308 17.6893 146.5285 2.2844 79.3950 204.1529 1.8868 30.5220 2.8744 46.1495 56.7012 59.3585 8.9578 58.8664 0.3560 4.3975 15.3874 0.9592 47.9509 68.8280 10.9731 43.4594 81.1032 13.0298 19.4122 10.9197 9.7778 22.7918 38.4713 25.0602
temp: 298.150 k
press: 1.00000 atm
elementType: 8 8 7 6 6 6 6 6 6 6 6 6 6 6 6 6 6 6 6 1 1 1 1 1 1 1 1 1 1 1 1 1 1 1 1 1 1 1 1 1 1 1
symmnumber: 1
zpe: 932102.6 jmol-1
zpe.correction: 0.355019 hartree
zpe.thermalcorrener: 0.375717 hartree
zpe.thermalcorrenthalpy: 0.376662 hartree
zpe.thermalcorrgfe: 0.304394 hartree
zpe.sumelectzpe: -827.238140 hartree
zpe.sumelectthermal: -827.217442 hartree
zpe.sumelectthermalent: -827.216498 hartree
zpe.sumelectthermalfe: -827.288765 hartree
dipole: 2.4092 -0.0525 3.5548
dipole: 4.2946
quadrupole: -107.4698 -107.1880 -118.6402
quadrupole: -4.8836 -4.1620 -10.3572
quadrupole: 3.6295 3.9113 -7.5409 -4.8836 -4.1620 -10.3572
hfenergy: -827.5931591 hartree
pointgroup: C01 [X(C16H23N1O2)]
dipole: 0.9312363 -0.1644864 1.4002146 debye
polarizability: 262.8654663|6.1538191|204.2535291|6.0921585|6.8999876|123.8276526 unknown
InChI: InChI=1S/C16H23NO2/c1-4-7-12-10-13(8-5-2)15(19-9-6-3)14(11-12)16(17)18/h6,10-11H,3-5,7-9,17H2,1-2H3
charge 0 multiplicity 1
42 atoms
O  -1.995643 0.151061 -0.552231
O  -1.283313 -2.816065 -1.557026
N  0.215125 -3.468894 0.082619
C  0.03614 1.357163 -0.657464
C  2.260222 0.261354 -0.616576
C  -0.799908 2.625558 -0.677514
C  3.777041 0.369447 -0.597298
C  1.443099 1.42037 -0.674082
C  -0.597353 0.074884 -0.591746
C  0.192028 -1.113915 -0.579021
C  -1.258428 3.071591 0.740205
C  1.612435 -0.988339 -0.573335
C  4.348624 0.644863 0.822277
C  -2.125851 4.347307 0.695704
C  5.887259 0.764916 0.82609
C  -0.371843 -2.503625 -0.728456
C  -2.832553 -0.939016 0.011243
C  -4.089741 -0.300951 0.538808
C  -5.336823 -0.710888 0.199991
H  -1.700721 2.473813 -1.299315
H  -0.211016 3.444876 -1.134878
H  4.108199 1.184821 -1.271073
H  4.229503 -0.564681 -0.985077
H  1.918408 2.408512 -0.735071
H  -1.830622 2.245589 1.203701
H  -0.367185 3.241655 1.376318
H  2.219154 -1.901949 -0.60485
H  4.031411 -0.169432 1.503614
H  3.897576 1.575386 1.220243
H  -2.443171 4.654665 1.70926
H  -3.036547 4.182676 0.08984
H  -1.57073 5.191852 0.244762
H  6.3604 -0.165096 0.457772
H  6.223063 1.592254 0.172616
H  6.272995 0.960291 1.843355
H  -2.265305 -1.430601 0.830817
H  -3.035055 -1.687468 -0.772737
H  -0.064163 -4.441271 -0.04447
H  0.885044 -3.227217 0.810275
H  -3.949519 0.526237 1.249052
H  -6.230785 -0.248302 0.632487
H  -5.497154 -1.522931 -0.519929
