program: Gaussian 09
title: 000235976
version: EM64L-G09RevD.01
frameworkgroup: C1[X(C14H14N2O)]
method: RPBEPBE
basis: SDD
operation: Freq
keyword: #p
keyword: freq=noraman
keyword: PBEPBE/SDD
title: #p freq=noraman PBEPBE/SDD
converged: NO YES NO NO
title: Mulliken charges:
elementType: O N N C C C C C C C C C C C C C C H H H H H H H H H H H H H H
charge: -0.257185 0.014621 -0.004339 -0.580157 0.472494 -0.264364 -0.401094 -0.401094 -0.224261 -0.224269 -0.240483 0.399505 -0.341784 -0.293769 -0.429287 -0.179584 -0.327550 0.226494 0.226302 0.225534 0.224996 0.233897 0.233846 0.226177 0.226171 0.229315 0.239070 0.237766 0.275848 0.233413 0.243773
chargesum: 0.00000
title: Mulliken charges with hydrogens summed into heavy atoms:
elementType: O N N C C C C C C C C C C C C C C
charge: -0.257185 0.014621 -0.004339 -0.127361 0.472494 0.186166 -0.167198 -0.167248 0.001916 0.001902 -0.011168 0.399505 -0.102714 -0.056003 -0.153439 0.053828 -0.083778
polarizability: 2.91581288e+02 1.44946742e+01 1.32480494e+02 1.25265914e+00 -6.91593228e-01 1.15301693e+02
1716.lowfreq: -15.3822 -3.8636 -0.0003 -0.0002 0.0007 2.0358 4.3234 22.3280 33.6410
frequency: -12.2364 22.0114 33.6234 46.8754 80.9180 93.2609 146.4829 166.5328 170.6423 213.1289 280.4179 322.3600 337.0809 383.4869 397.6677 403.2105 476.9529 506.6531 536.6489 573.1931 610.1081 617.8013 652.8808 704.5353 716.3755 759.4356 802.5309 804.9036 811.2660 843.6747 854.5762 909.1527 919.5330 922.4869 937.4012 955.8843 976.8273 983.0371 986.0348 990.8513 995.0798 1002.5496 1017.5379 1026.9085 1029.2060 1065.4615 1093.0650 1117.3098 1171.3409 1173.3958 1187.2990 1198.6193 1213.9471 1224.9950 1262.9532 1290.8925 1307.1015 1326.6497 1332.0949 1335.9409 1368.6033 1383.3969 1412.0902 1440.3208 1454.1669 1475.5734 1485.1127 1490.1377 1534.6098 1573.0540 1584.6377 1594.3980 1615.3163 2995.5567 3007.5483 3051.8093 3052.0031 3078.8525 3116.2871 3116.3691 3128.1384 3132.9761 3137.2997 3145.2023 3148.6104 3163.6084 3168.3312
redmass: 4.0576 4.3922 5.8123 3.3131 2.7997 5.0990 4.4759 6.2396 4.1393 4.8662 3.6478 4.1819 2.4352 7.8420 3.2421 2.8194 4.1965 4.0447 3.9733 5.3109 7.5440 6.3687 6.1563 1.7960 1.8584 1.8488 1.1512 4.6745 1.6322 4.6963 1.2458 5.9773 1.5507 1.3617 1.3707 1.6019 1.3878 6.8727 1.4004 6.3092 1.3199 3.8167 1.5460 2.2110 2.9512 3.8713 1.4625 1.5914 1.1224 1.0797 1.1145 1.3144 2.3821 1.7353 1.1889 1.4579 5.9380 1.2608 1.4193 1.6601 1.4103 8.1739 2.2047 2.1808 2.3542 1.1294 2.1618 1.0903 5.4211 6.3294 5.7350 6.0812 6.1870 1.0570 1.0584 1.1049 1.0892 1.1078 1.0884 1.0862 1.0884 1.0906 1.0910 1.0958 1.0925 1.1015 1.0999
irintensity: 0.3599 2.2362 0.3288 0.0160 0.1081 0.0137 2.6543 0.2734 8.4238 0.4704 1.0167 2.4595 0.7540 0.8545 4.5451 0.0031 6.8743 3.4437 73.2143 6.5607 3.9999 0.1209 14.2824 50.5581 39.3048 45.4076 0.0703 1.0652 28.5377 8.7364 0.0081 236.4658 44.7807 5.1757 7.0284 21.4612 0.0794 192.5155 2.7849 5.7939 1.0470 21.7116 0.6558 4.6511 7.3420 18.8837 10.6459 7.7455 0.0547 0.0347 0.2768 1.2628 0.2532 13.9092 0.2259 0.6250 1.9968 0.3265 2.3080 14.5618 41.7145 0.0556 18.7967 7.7555 18.0695 17.5687 12.5657 21.3001 5.7226 17.2719 2.1440 1.2742 9.9218 34.6220 40.8142 1.1860 16.7622 36.7979 5.9722 12.1196 4.3459 9.8678 17.8295 42.8520 6.5469 25.3395 29.4676
temp: 298.150 k
press: 1.00000 atm
elementType: 8 7 7 6 6 6 6 6 6 6 6 6 6 6 6 6 6 1 1 1 1 1 1 1 1 1 1 1 1 1 1
symmnumber: 1
zpe: 647041.0 jmol-1
zpe.correction: 0.246445 hartree
zpe.thermalcorrener: 0.260803 hartree
zpe.thermalcorrenthalpy: 0.261747 hartree
zpe.thermalcorrgfe: 0.202492 hartree
zpe.sumelectzpe: -725.339833 hartree
zpe.sumelectthermal: -725.325474 hartree
zpe.sumelectthermalent: -725.324530 hartree
zpe.sumelectthermalfe: -725.383785 hartree
dipole: 0.5322 -2.5925 -0.0643
dipole: 2.6473
quadrupole: -83.3043 -103.5402 -96.2783
quadrupole: 18.5308 0.6484 -0.4657
quadrupole: 11.0700 -9.1659 -1.9041 18.5308 0.6484 -0.4657
hfenergy: -725.5862774 hartree
pointgroup: C01 [X(C14H14N2O1)]
dipole: -0.2541067 0.2571664 0.9767804 debye
polarizability: 289.9378561|8.7222722|116.249875|19.9028811|3.9571006|133.1757432 unknown
InChI: InChI=1S/C14H14N2O/c1-2-5-13(6-3-1)8-10-17-16-12-14-7-4-9-15-11-14/h1-7,9,11-12H,8,10H2
charge 0 multiplicity 1
31 atoms
O  0.020664 0.278496 1.031761
N  1.212756 0.072195 0.227672
N  5.092285 -0.339884 -1.536585
C  -2.396042 0.290954 1.076264
C  -3.686426 0.048881 0.303366
C  -1.170836 0.022024 0.185391
C  -4.296098 1.095208 -0.435411
C  -4.284392 -1.2372 0.276017
C  -5.472662 0.863941 -1.183108
C  -5.460766 -1.473625 -0.470356
C  -6.05876 -0.422841 -1.203876
C  3.631512 0.148829 0.380057
C  2.288825 0.28542 0.957036
C  4.774277 0.38289 1.192533
C  3.856126 -0.211773 -0.98334
C  6.061867 0.253112 0.631553
C  6.175601 -0.107779 -0.730156
H  -2.340251 -0.369735 1.960694
H  -2.346323 1.334263 1.437755
H  -1.145254 0.697063 -0.690132
H  -1.145263 -1.025247 -0.169039
H  -3.850416 2.097906 -0.417936
H  -3.829696 -2.055337 0.848999
H  -5.932917 1.684872 -1.744567
H  -5.911653 -2.472421 -0.477057
H  -6.972243 -0.603432 -1.781385
H  2.202909 0.573085 2.018404
H  4.65045 0.662232 2.245723
H  3.002645 -0.400671 -1.643114
H  6.959844 0.427255 1.232295
H  7.156638 -0.21868 -1.205556
