program: Gaussian 09
title: 000235971
version: EM64L-G09RevD.01
frameworkgroup: C1[X(C17H20O3)]
method: RPBEPBE
basis: SDD
operation: Freq
keyword: #pfreq=noraman
keyword: PBEPBE/SDD
title: #p freq=noraman PBEPBE/SDD
converged: YES YES NO NO
title: Mulliken charges:
elementType: O O O C C C C C C C C C C C C C C C C C H H H H H H H H H H H H H H H H H H H H
charge: -0.422486 -0.226717 -0.265659 -0.209199 -0.184628 0.269079 0.123161 -0.483616 -0.535602 -0.582065 0.180791 -0.620025 0.411392 -0.752155 0.133870 -0.379014 -0.603623 -0.405551 0.325800 -0.536549 0.253251 0.246627 0.240165 0.211863 0.228676 0.225181 0.236590 0.215663 0.218778 0.223381 0.219474 0.224174 0.222883 0.244056 0.245962 0.246784 0.376240 0.219126 0.220220 0.243701
chargesum: 0.00000
title: Mulliken charges with hydrogens summed into heavy atoms:
elementType: O O O C C C C C C C C C C C C C C C C C
charge: -0.046246 -0.226717 -0.265659 0.044052 0.062000 0.269079 0.123161 -0.031588 -0.081744 -0.129811 0.180791 -0.177866 0.411392 -0.085624 0.133870 -0.134959 -0.357662 -0.158767 0.325800 0.146497
polarizability: 2.68334267e+02 1.45773485e+01 1.89645795e+02 -1.02331949e+01 1.14195975e+01 1.31436004e+02
1716.lowfreq: -16.9834 -5.4885 -0.0004 0.0004 0.0008 7.4243 26.6282 33.7282 55.7957
frequency: 26.2384 33.4753 55.6455 64.6665 110.4081 118.1331 149.1178 166.3327 184.3502 206.7192 215.1156 231.4282 240.6289 265.0350 284.7338 306.0209 326.3731 354.5973 391.4869 404.0978 441.5019 447.6691 461.2687 481.9934 503.5175 537.8118 541.1779 565.2732 594.2527 602.4320 613.6084 648.6913 668.0605 706.2469 707.3499 748.4785 798.8090 824.5257 839.8660 853.7421 861.3349 877.4696 892.1759 923.3080 952.3880 958.6968 985.9736 1000.3739 1010.9552 1013.6553 1029.9038 1044.3207 1070.4702 1081.5169 1098.2178 1112.3979 1122.3787 1142.3036 1155.8316 1160.3383 1169.0997 1178.4469 1186.8697 1198.2089 1227.5707 1242.3771 1252.4016 1269.6833 1281.2524 1284.7275 1289.2912 1320.4092 1328.1149 1341.3667 1354.6994 1358.9893 1367.0721 1379.6287 1387.4918 1422.0283 1444.5524 1450.1980 1456.1410 1461.8582 1465.3271 1466.7021 1472.5816 1475.9455 1481.4814 1500.2641 1575.5776 1616.6455 1651.5875 1655.3322 2944.0718 2951.8410 2952.4552 2955.2416 2969.3127 2973.9728 2974.8515 2999.8235 3017.5786 3023.6599 3033.9412 3041.4902 3067.9373 3075.2278 3077.7350 3121.3246 3138.7162 3143.0988 3168.6934 3509.6529
redmass: 6.8276 7.4851 3.8226 4.4685 3.7687 3.4719 3.5166 3.2719 2.9742 1.2848 1.5970 2.0805 2.3659 2.4055 2.3060 2.6796 3.6776 3.8086 3.8523 4.3217 3.6202 3.9329 3.1363 3.2386 4.2536 3.4696 3.6214 3.4444 2.7418 4.0441 2.6843 1.7443 2.9483 3.4192 4.2520 3.3850 3.0624 1.4953 2.0070 2.8637 1.5410 2.3367 3.9220 2.1078 1.4132 2.1376 2.9232 2.6274 2.6335 2.0871 2.0758 2.4592 2.0434 2.5076 1.8439 1.2602 1.9499 1.5188 1.3514 1.2187 1.4775 1.6796 1.2457 1.8915 1.4844 2.6909 1.4395 2.2731 1.4765 1.5752 1.3705 1.6253 1.7767 1.6074 1.4693 1.6238 3.0286 2.3390 1.4495 2.1913 1.5573 1.1044 1.0956 1.0815 1.0504 1.1040 1.0787 1.0628 1.0560 2.5791 7.5687 6.4728 8.1521 8.3999 1.0693 1.0634 1.0632 1.0331 1.0798 1.0393 1.0793 1.0810 1.0782 1.0925 1.0948 1.1037 1.0996 1.0994 1.0993 1.0990 1.0903 1.0873 1.0961 1.0639
irintensity: 0.6699 1.3108 0.6222 1.5074 2.8083 1.0502 1.5989 1.7185 1.5587 0.1774 0.8497 1.5097 2.5772 0.9325 1.9301 3.3011 0.7304 5.0526 0.5562 8.9101 9.4912 2.4057 11.5254 8.7014 3.3261 22.7003 18.8130 3.8695 11.1404 1.3625 1.2523 119.5784 1.2088 18.0412 6.9594 0.2205 3.9243 33.0394 6.6830 5.2228 30.6748 3.4278 16.1466 3.3269 0.6455 29.6848 9.3503 107.5728 29.8513 46.2527 37.9403 55.3797 83.3673 3.3034 7.2594 0.2056 6.7278 17.1501 3.1833 0.8940 12.4391 63.4682 0.9471 13.9975 25.8028 88.7873 1.0063 20.7971 18.6218 23.2546 5.7062 9.0281 24.8896 13.8243 2.3705 0.9298 2.6172 19.3095 12.5271 20.1323 3.3673 9.3403 7.2150 12.9017 12.8138 6.1372 65.9310 17.2395 9.4327 77.3540 6.5142 94.0596 76.2977 116.0676 24.7035 32.8473 31.6216 76.7672 11.7214 36.4214 33.3083 17.0083 51.3201 46.1589 34.9165 51.6760 45.2511 51.7867 11.5424 31.6760 19.7250 6.7466 11.8485 22.1657
temp: 298.150 k
press: 1.00000 atm
elementType: 8 8 8 6 6 6 6 6 6 6 6 6 6 6 6 6 6 6 6 6 1 1 1 1 1 1 1 1 1 1 1 1 1 1 1 1 1 1 1 1
symmnumber: 1
zpe: 869502.3 jmol-1
zpe.correction: 0.331176 hartree
zpe.thermalcorrener: 0.349616 hartree
zpe.thermalcorrenthalpy: 0.350560 hartree
zpe.thermalcorrgfe: 0.284324 hartree
zpe.sumelectzpe: -884.006488 hartree
zpe.sumelectthermal: -883.988048 hartree
zpe.sumelectthermalent: -883.987104 hartree
zpe.sumelectthermalfe: -884.053340 hartree
dipole: 0.1678 1.4882 -0.8747
dipole: 1.7344
quadrupole: -103.8833 -109.2320 -123.8561
quadrupole: -11.0914 -6.6754 -0.8095
quadrupole: 8.4405 3.0918 -11.5323 -11.0914 -6.6754 -0.8095
hfenergy: -884.3376641 hartree
pointgroup: C01 [X(C17H20O3)]
dipole: -0.0613365 -0.5830043 -0.349255 debye
polarizability: 268.0590169|14.8058057|189.898387|11.5996731|-10.8059306|131.4586619 unknown
InChI: InChI=1S/C17H20O3/c1-10-13-5-3-11-9-12(20-2)4-6-15(11)16(13)8-7-14(10)17(18)19/h4,6,9-10,14,18H,3,5,7-8H2,1-2H3
charge 0 multiplicity 1
40 atoms
O  -4.126321 2.107636 0.707861
O  -3.370596 0.454726 2.140554
O  5.100538 0.869063 0.194455
C  -2.663435 -1.299132 -0.044876
C  -3.453572 0.008669 -0.310389
C  -1.157953 -1.052883 -0.002995
C  -0.550241 0.08356 -0.479302
C  -2.799946 0.822358 -1.458967
C  -1.34996 1.21654 -1.113951
C  -0.327014 -2.10996 0.71551
C  0.914729 0.272077 -0.309705
C  1.096302 -2.213058 0.132368
C  1.74406 -0.840465 0.026599
C  -3.043871 -2.395578 -1.079428
C  -3.607296 0.82607 0.970112
C  1.539591 1.540672 -0.477472
C  3.13507 -0.676609 0.201803
C  2.924342 1.711434 -0.306009
C  3.729251 0.599655 0.038775
C  5.970866 -0.249007 0.560233
H  -2.955392 -1.673055 0.958475
H  -4.490294 -0.247805 -0.616314
H  -3.398082 1.723496 -1.675927
H  -2.808044 0.190503 -2.367135
H  -1.360438 2.088457 -0.425542
H  -0.840637 1.56677 -2.033334
H  -0.275898 -1.842724 1.793797
H  -0.827291 -3.095866 0.665516
H  1.031608 -2.655183 -0.885466
H  1.720285 -2.894469 0.740165
H  -4.109918 -2.67518 -0.980928
H  -2.869058 -2.050111 -2.114568
H  -2.441773 -3.309456 -0.929251
H  0.936221 2.416928 -0.735641
H  3.741236 -1.551434 0.46052
H  3.400744 2.688787 -0.428157
H  -4.247373 2.58616 1.572759
H  5.96001 -1.040487 -0.214865
H  5.679869 -0.684702 1.536349
H  6.979981 0.182802 0.633672
