program: Gaussian 09
title: 000235968
version: EM64L-G09RevD.01
frameworkgroup: C1[X(C10H19NO2)]
method: RPBEPBE
basis: SDD
operation: Freq
keyword: #p
keyword: freq=noraman
keyword: PBEPBE/SDD
title: #p freq=noraman PBEPBE/SDD
converged: YES YES NO NO
title: Mulliken charges:
elementType: O O N C C C C C C C C C C H H H H H H H H H H H H H H H H H H H
charge: -0.415940 -0.233181 -0.570867 0.013061 -0.488695 -0.489996 -0.432228 -0.427380 -0.445960 -0.358925 -0.427710 -0.173818 0.132940 0.204990 0.192612 0.222510 0.227777 0.193746 0.202774 0.215382 0.212453 0.204997 0.196810 0.194386 0.252221 0.183690 0.223350 0.209669 0.246444 0.279660 0.278360 0.376867
chargesum: 0.00000
title: Mulliken charges with hydrogens summed into heavy atoms:
elementType: O O N C C C C C C C C C C
charge: -0.039073 -0.233181 -0.012847 0.218051 -0.073573 -0.068473 -0.014072 -0.009929 -0.054764 0.076986 0.005309 0.072626 0.132940
polarizability: 1.48111297e+02 -3.04253252e+00 1.12096705e+02 2.59984871e+00 2.31794920e+00 9.89449126e+01
1716.lowfreq: -10.0422 -5.8147 0.0001 0.0008 0.0009 4.7734 22.0353 30.9444 35.2621
frequency: 11.3208 30.7617 33.9122 44.1570 63.4247 102.0706 121.9161 136.4936 180.4801 210.3974 223.6842 265.9795 304.7026 355.5353 396.5909 431.2027 502.1400 560.5118 598.0365 608.5560 618.5010 685.8412 709.7085 744.7741 757.1658 807.1118 815.0779 851.3229 865.2018 890.8719 929.4599 950.0685 952.0698 968.6510 1013.5149 1026.8847 1036.1163 1052.2523 1065.3529 1071.4289 1109.7926 1114.5474 1142.5376 1175.7843 1183.9608 1207.7064 1216.4252 1225.6693 1239.1142 1249.9192 1267.9827 1276.7794 1288.0975 1293.2532 1298.4781 1300.0067 1300.8185 1311.6635 1332.3542 1346.1803 1354.1101 1362.4764 1458.3159 1459.5011 1463.1400 1471.5861 1472.7678 1482.4153 1491.3786 1651.2438 1655.2490 2941.1859 2945.9027 2962.0086 2971.2279 2973.9599 2978.1475 2990.8516 2997.8042 3007.8449 3025.2985 3034.9944 3039.1098 3048.5552 3053.8252 3060.2844 3074.5175 3444.7874 3499.9929 3567.3299
redmass: 1.6049 3.8072 4.8456 5.0720 3.3952 3.1857 2.0647 3.1816 2.6270 1.2045 2.8094 3.5449 3.0490 3.1175 2.6983 2.2943 2.8442 2.4575 1.8744 1.9100 2.6982 1.7120 3.5991 1.1798 1.2163 1.5445 1.5690 4.1472 2.7999 2.4085 2.2821 1.8033 1.8180 1.3967 1.4543 2.9009 2.6416 2.8600 2.5055 1.2954 1.8063 2.4839 2.5741 1.4827 1.4011 1.5347 1.2914 1.3179 1.3999 1.3363 1.2698 1.3888 1.2913 1.2413 1.4288 1.2510 1.2517 1.3501 1.4274 1.5502 1.6559 1.3872 1.0869 1.0726 1.0794 1.0839 1.0841 1.0947 1.0992 1.2366 4.4639 1.0735 1.0679 1.0657 1.0628 1.0616 1.0643 1.0613 1.0963 1.0661 1.0902 1.0979 1.0914 1.1002 1.1018 1.1005 1.1046 1.0453 1.0641 1.0965
irintensity: 0.0310 0.5715 0.4339 0.2788 0.3204 0.2881 0.2104 0.0432 0.7551 41.2618 1.4512 8.2186 7.4302 15.5503 9.0348 8.5461 10.6644 16.8360 70.8601 57.8999 5.1020 237.3962 32.5109 6.0042 10.2901 0.2363 1.5899 15.9848 1.2245 7.8410 4.7036 4.4264 1.2865 0.5901 9.0211 150.8773 94.2469 0.6466 0.9423 1.0829 0.1661 8.6846 14.0172 0.8232 6.5972 1.3893 8.3776 0.6772 5.1342 8.2211 2.7625 3.5329 5.6955 2.7349 12.8246 1.5956 3.4526 0.6287 1.0666 2.2354 0.8147 4.6578 1.7635 0.9473 2.9498 7.8146 8.4317 13.4419 2.7439 5.4007 273.0050 7.0785 21.7892 9.2646 20.7479 50.4384 64.5008 36.4969 40.0764 62.8443 5.0603 34.6190 9.0999 12.4457 9.7286 73.0416 122.3275 1.1509 11.6068 3.3944
temp: 298.150 k
press: 1.00000 atm
elementType: 8 8 7 6 6 6 6 6 6 6 6 6 6 1 1 1 1 1 1 1 1 1 1 1 1 1 1 1 1 1 1 1
symmnumber: 1
zpe: 734591.6 jmol-1
zpe.correction: 0.279791 hartree
zpe.thermalcorrener: 0.294859 hartree
zpe.thermalcorrenthalpy: 0.295804 hartree
zpe.thermalcorrgfe: 0.233904 hartree
zpe.sumelectzpe: -596.609478 hartree
zpe.sumelectthermal: -596.594410 hartree
zpe.sumelectthermalent: -596.593466 hartree
zpe.sumelectthermalfe: -596.655366 hartree
dipole: 0.0902 -0.5760 -0.8861
dipole: 1.0606
quadrupole: -81.1686 -77.9312 -81.1561
quadrupole: -2.8156 -6.0416 -0.8248
quadrupole: -1.0833 2.1541 -1.0708 -2.8156 -6.0416 -0.8248
hfenergy: -596.8892697 hartree
pointgroup: C01 [X(C10H19N1O2)]
dipole: -0.0312622 0.2164324 -0.3554012 debye
polarizability: 147.9918828|-3.766953|112.0666283|-2.5096817|-2.6736949|99.0944035 unknown
InChI: InChI=1S/C10H19NO2/c11-9(10(12)13)7-3-6-8-4-1-2-5-8/h8-9,12H,1-7,11H2
charge 0 multiplicity 1
32 atoms
O  -4.270874 1.364421 -0.802162
O  -4.694193 -0.065983 0.980106
N  -2.527682 -1.780612 0.062525
C  2.476278 0.379485 -0.230008
C  3.656576 1.167895 0.396823
C  2.894135 -1.095388 0.022048
C  4.923874 0.360515 -0.000378
C  4.440472 -1.122491 -0.176512
C  1.091767 0.767877 0.332074
C  -0.083284 0.017844 -0.336095
C  -1.455737 0.467012 0.206222
C  -2.626246 -0.382949 -0.374878
C  -3.958746 0.275649 0.027291
H  2.477343 0.562699 -1.327244
H  3.535808 1.179022 1.499425
H  3.696672 2.220027 0.059211
H  2.372494 -1.810914 -0.638262
H  2.633965 -1.364666 1.066213
H  5.724515 0.451054 0.755749
H  5.336242 0.743831 -0.952533
H  4.697318 -1.494077 -1.185693
H  4.926333 -1.802043 0.546817
H  0.94373 1.862114 0.211453
H  1.080452 0.569661 1.425467
H  0.01417 -1.072315 -0.181242
H  -0.05028 0.190355 -1.432744
H  -1.630999 1.532459 -0.038444
H  -1.470632 0.378688 1.312449
H  -2.557236 -0.346205 -1.477692
H  -3.110602 -2.427919 -0.478425
H  -2.69483 -1.88944 1.070037
H  -5.115901 1.789895 -0.489998
