program: Gaussian 09
title: 000235954
version: EM64L-G09RevD.01
frameworkgroup: C1[X(C19H36O2)]
method: RPBEPBE
basis: SDD
operation: Freq
keyword: #pfreq=noraman
keyword: PBEPBE/SDD
title: #p freq=noraman PBEPBE/SDD
converged: NO YES NO NO
title: Mulliken charges:
elementType: O O C C C C C C C C C C C C C C C C C C C H H H H H H H H H H H H H H H H H H H H H H H H H H H H H H H H H H H H
charge: -0.288056 -0.250814 -0.112261 -0.035503 -0.123615 -0.002362 -0.599374 -0.113490 -0.468637 -0.458023 -0.782797 -0.434378 -0.734929 -0.738867 -0.717714 0.045277 -0.728485 0.263162 -0.494135 -0.349845 -0.683360 0.208242 0.215398 0.203250 0.213238 0.217856 0.221652 0.214582 0.228118 0.210522 0.200133 0.208598 0.225184 0.211985 0.221574 0.209209 0.196855 0.208588 0.229303 0.206174 0.209886 0.233287 0.204263 0.208519 0.214340 0.226333 0.230231 0.214725 0.249831 0.221054 0.237516 0.231241 0.228434 0.208570 0.208118 0.208941 0.222457
chargesum: 0.00000
title: Mulliken charges with hydrogens summed into heavy atoms:
elementType: O O C C C C C C C C C C C C C C C C C C C
charge: -0.288056 -0.250814 0.095981 0.179894 0.079635 0.210876 -0.159865 0.101092 -0.029998 -0.049292 -0.124055 -0.028314 -0.090863 -0.091431 -0.068522 0.275508 -0.042876 0.263162 -0.025378 0.087159 -0.043843
polarizability: 2.34113132e+02 1.46073726e+01 2.10358733e+02 -1.47973381e+00 6.79960355e-01 1.84769498e+02
1716.lowfreq: -15.0721 -5.7027 -0.0005 0.0004 0.0009 6.2359 9.2300 14.3753 30.5832
frequency: 5.9781 12.3425 30.5605 36.4737 47.6336 66.5735 74.0918 89.3426 96.9283 101.1708 115.9463 130.2554 142.1311 144.8967 170.5248 181.4620 203.8604 207.3896 211.4115 223.1297 225.4676 232.9481 236.6792 245.0189 262.3738 288.6879 301.2513 331.7301 346.2688 362.1554 385.3716 406.6518 427.1247 434.3024 463.8705 473.2771 502.6137 515.6862 563.0560 658.9350 662.6645 686.5965 730.2429 739.6056 763.2171 784.0489 796.0776 812.2713 854.3337 868.6592 877.8779 881.8963 911.6363 913.0576 918.8178 935.6484 939.7142 951.1412 957.3920 967.5455 988.3821 1010.9048 1019.7856 1025.8885 1040.1412 1057.7260 1058.8386 1061.1139 1075.5227 1090.2372 1095.6038 1097.2654 1109.0504 1114.1192 1124.7913 1147.2170 1150.4709 1154.9744 1165.5820 1180.1938 1198.3109 1202.7517 1222.1511 1227.2331 1244.8186 1263.6036 1264.8196 1276.0413 1278.1150 1282.4907 1285.9473 1295.4205 1298.0072 1306.2787 1308.7009 1322.8327 1324.0543 1329.2622 1332.6689 1345.1221 1350.4099 1356.0950 1360.0747 1365.0979 1375.7990 1387.8394 1390.0977 1390.1377 1391.7508 1393.5892 1444.0158 1447.0214 1463.3907 1464.8754 1466.3337 1470.0394 1474.4558 1475.1559 1476.2200 1477.2158 1478.1727 1479.0925 1481.7394 1483.8971 1485.4450 1486.8155 1487.0144 1491.6516 1632.9379 2942.0451 2946.0711 2961.2000 2963.9157 2965.5036 2967.4737 2969.9641 2971.7372 2973.4282 2973.5838 2975.2052 2978.4765 2979.2675 2982.4813 2987.9536 2988.9005 3000.3387 3012.4883 3015.3811 3029.7515 3036.7666 3038.7204 3053.9647 3054.1298 3055.9767 3061.7282 3064.1166 3066.5804 3070.1576 3071.1897 3071.6306 3075.0397 3075.9807 3079.1618 3083.8577 3099.4241
redmass: 3.5394 2.9920 2.4209 3.9824 3.2832 2.5959 3.0208 2.5702 2.8563 3.4835 2.7125 2.5687 2.1887 2.8334 2.5732 2.1588 1.1184 1.1599 1.2109 1.2710 1.3522 1.5100 1.4139 2.2155 2.3746 2.7596 3.1115 2.6780 2.9639 2.6609 2.6882 2.9107 2.7925 2.6777 2.7317 2.5056 2.8143 2.8118 2.9776 2.5720 2.4379 4.5673 1.7526 1.2044 2.4891 1.6731 1.6865 2.5984 2.0046 1.3360 2.6467 2.4209 1.6457 1.8671 1.2276 2.7001 1.6666 1.5369 1.7529 1.5314 1.5825 1.7174 2.4644 1.9797 1.7651 2.3386 2.2212 2.1828 1.5670 1.9259 1.8419 1.9178 2.3410 2.0589 1.9543 2.4519 2.3831 2.4615 2.4324 1.8119 1.6075 1.6795 1.3338 1.5187 1.3908 1.2607 1.2273 1.2831 1.2628 1.2658 1.2817 1.3127 1.2891 1.2999 1.2561 1.4296 1.3230 1.2970 1.3859 1.5045 1.5176 1.4644 1.7077 1.5613 1.2162 1.2265 1.2096 1.2120 1.2114 1.2103 1.0852 1.0801 1.0655 1.0596 1.0553 1.0508 1.0500 1.0567 1.0590 1.0442 1.0549 1.0469 1.0608 1.0479 1.0675 1.0801 1.0686 1.0526 9.7898 1.0800 1.0816 1.0602 1.0808 1.0396 1.0584 1.0505 1.0367 1.0393 1.0538 1.0436 1.0681 1.0647 1.0679 1.0545 1.0617 1.0618 1.0869 1.1002 1.0940 1.1023 1.0956 1.0992 1.0995 1.0980 1.0983 1.0990 1.0994 1.0996 1.0990 1.0988 1.0981 1.0994 1.1011 1.0986 1.1003
irintensity: 0.0604 0.0105 0.3239 0.4731 1.0856 0.0302 0.2882 0.1468 0.1939 1.2324 0.0308 1.0614 1.2493 0.7528 0.1024 0.9626 0.1438 0.8708 0.0348 1.2530 0.7701 1.8032 1.8913 2.8040 0.4735 0.6900 1.9639 0.3857 1.9670 1.0953 0.1947 4.4747 3.2773 1.4028 3.1494 1.9185 1.7739 0.2280 3.5704 1.1801 4.1551 2.8100 0.0332 15.7104 1.0091 14.7305 7.7360 0.3922 2.9591 0.4687 1.0654 7.4895 4.7614 1.9555 3.2377 47.4978 11.2460 2.4366 6.5923 20.1922 3.2147 1.9531 10.6364 18.3466 1.8821 23.7237 0.4112 10.6182 8.8282 107.7754 4.5373 2.7057 39.1794 1.9022 85.7173 170.8781 6.8394 5.2470 5.1377 8.5559 9.1726 0.3691 6.0303 2.5560 2.5282 6.1192 1.8587 16.8611 9.4777 0.6391 0.3292 14.1893 23.7131 10.6808 2.4552 0.6348 1.2340 2.8094 3.6584 3.8281 4.5280 4.5721 27.4136 3.7838 15.4852 25.3269 8.5328 5.3916 35.0747 11.5617 21.1025 1.8182 9.7316 1.7574 11.2922 3.7252 5.1946 2.1366 7.2995 11.0039 10.7409 9.7938 9.7161 5.9893 4.3479 15.9982 10.1420 14.6048 167.4117 4.9483 8.7121 36.5324 7.2963 31.2929 7.2812 40.1542 32.9390 49.5041 4.2597 35.1487 64.5680 4.7351 85.2772 3.9792 40.0528 24.3757 7.9897 18.6460 5.8895 40.3910 2.1150 14.0292 37.5476 1.5648 99.3191 23.8753 85.4420 23.7105 31.6612 88.8785 51.0576 51.0466 75.9386 42.4776 21.2742
temp: 298.150 k
press: 1.00000 atm
elementType: 8 8 6 6 6 6 6 6 6 6 6 6 6 6 6 6 6 6 6 6 6 1 1 1 1 1 1 1 1 1 1 1 1 1 1 1 1 1 1 1 1 1 1 1 1 1 1 1 1 1 1 1 1 1 1 1 1
symmnumber: 1
zpe: 1344928.2 jmol-1
zpe.correction: 0.512256 hartree
zpe.thermalcorrener: 0.538628 hartree
zpe.thermalcorrenthalpy: 0.539572 hartree
zpe.thermalcorrgfe: 0.452522 hartree
zpe.sumelectzpe: -894.356778 hartree
zpe.sumelectthermal: -894.330406 hartree
zpe.sumelectthermalent: -894.329462 hartree
zpe.sumelectthermalfe: -894.416512 hartree
dipole: -0.8057 0.3209 -1.5508
dipole: 1.7768
quadrupole: -133.9604 -131.1782 -138.2074
quadrupole: 5.9541 -6.2679 3.6941
quadrupole: 0.4883 3.2705 -3.7588 5.9541 -6.2679 3.6941
hfenergy: -894.8690345 hartree
pointgroup: C01 [X(C19H36O2)]
dipole: -0.3337709 0.0555361 -0.6116918 debye
polarizability: 233.2573296|14.8603747|210.9061801|-4.1390365|-2.3918638|185.0778542 unknown
InChI: InChI=1S/C19H36O2/c1-7-9-19(20)21-14(5)10-11-17-15(6)16(8-2)12-18(17)13(3)4/h13-18H,7-12H2,1-6H3
charge 0 multiplicity 1
57 atoms
O  2.638528 -0.924485 -0.455352
O  3.916575 -1.139601 1.48741
C  -1.624649 -0.108348 -0.929308
C  -2.255405 1.271724 -0.527413
C  -2.781098 -1.10634 -0.597016
C  -3.291815 -0.597933 0.796257
C  -3.087985 0.954831 0.759267
C  -1.291998 2.480968 -0.389332
C  -0.309376 -0.441758 -0.175931
C  -4.716375 -1.047682 1.19228
C  -3.864027 -1.129912 -1.702189
C  0.363123 -1.746847 -0.659665
C  -0.507058 2.740351 -1.699454
C  -2.06665 3.760354 0.014727
C  -5.073257 -0.694016 2.65332
C  1.714281 -2.02454 0.013556
C  2.334907 -3.376632 -0.362495
C  3.716909 -0.600783 0.372652
C  4.592804 0.458292 -0.279138
C  5.447231 1.243892 0.738568
C  6.426844 2.212604 0.044341
H  -1.402098 -0.125993 -2.016746
H  -2.967993 1.538453 -1.337673
H  -2.393735 -2.140048 -0.49501
H  -2.603122 -1.013968 1.562209
H  -4.059886 1.483881 0.745288
H  -2.5537 1.303005 1.664358
H  -0.563854 2.258188 0.41966
H  0.416948 0.379831 -0.315711
H  -0.498364 -0.509598 0.914992
H  -4.809208 -2.144989 1.053356
H  -5.456225 -0.58125 0.51116
H  -4.667124 -1.851642 -1.467493
H  -3.417968 -1.429871 -2.669279
H  -4.337903 -0.141107 -1.844387
H  0.515783 -1.706453 -1.757037
H  -0.291091 -2.618586 -0.460342
H  0.16673 3.610997 -1.590229
H  0.108075 1.872138 -1.996428
H  -1.205876 2.95886 -2.530681
H  -1.379905 4.621525 0.118156
H  -2.597355 3.633924 0.975265
H  -2.81869 4.019588 -0.75637
H  -4.369909 -1.175292 3.359577
H  -6.09463 -1.029759 2.911811
H  -5.024393 0.397252 2.82515
H  1.639593 -1.932576 1.114399
H  1.674166 -4.200037 -0.0343
H  3.313686 -3.509423 0.128427
H  2.468285 -3.45414 -1.456389
H  3.954808 1.130461 -0.881147
H  5.256473 -0.061464 -1.001223
H  5.999137 0.526127 1.372534
H  4.779339 1.805329 1.41973
H  7.132244 1.665345 -0.609604
H  5.889868 2.948902 -0.583133
H  7.022988 2.773957 0.786324
