program: Gaussian 09
title: 000235935
version: EM64L-G09RevD.01
frameworkgroup: C1[X(C7H6N4S)]
method: RPBEPBE
basis: SDD
operation: Freq
keyword: #pfreq=noraman
keyword: PBEPBE/SDD
title: #p freq=noraman PBEPBE/SDD
converged: NO YES NO NO
title: Mulliken charges:
elementType: S N N N N C C C C C C C H H H H H H
charge: 0.295776 -0.180015 -0.039864 0.028995 0.048085 -0.324436 0.347300 -0.702258 -0.347475 -0.098666 -0.205671 -0.401890 0.260431 0.235147 0.289833 0.272654 0.268784 0.253271
chargesum: 0.00000
title: Mulliken charges with hydrogens summed into heavy atoms:
elementType: S N N N N C C C C C C C
charge: 0.295776 -0.180015 -0.039864 0.028995 0.048085 0.171141 0.347300 -0.139772 -0.347475 -0.098666 0.063113 -0.148619
polarizability: 1.44909070e+02 -6.65238513e+00 1.36889967e+02 1.24367722e+00 1.95239690e+00 5.50431577e+01
1716.lowfreq: -5.5958 -0.0020 -0.0017 -0.0014 7.0610 10.1910 112.3173 142.2462 212.2793
frequency: 112.3109 142.2457 212.2790 261.7857 305.5548 323.9401 377.9585 421.7022 501.5371 541.6271 581.3385 590.2622 599.9139 613.8165 643.0704 707.4554 792.1597 795.0116 836.8038 883.2134 920.6248 931.9591 965.2630 1007.6814 1053.0906 1140.6173 1162.6555 1180.4485 1204.1908 1242.3576 1257.9330 1289.3478 1296.4936 1311.0751 1341.2349 1371.8429 1400.5330 1424.5140 1437.8908 1472.5300 1496.9911 1599.3201 3002.3110 3045.5306 3065.0672 3127.0988 3176.8133 3231.8072
redmass: 4.6620 5.0515 5.4020 3.0622 3.7829 6.9665 14.3935 3.9063 5.4533 5.4074 6.2476 5.0448 6.1361 4.4811 5.8532 4.5441 7.3377 6.2078 1.5523 2.1900 1.4318 8.4882 2.0908 2.0317 5.5542 5.6184 1.9405 1.6156 1.5039 2.2297 4.0496 1.9970 3.8776 1.5616 1.6281 5.8601 1.5841 2.3812 1.1386 1.2718 8.3977 9.8457 1.0588 1.0645 1.0987 1.1078 1.0923 1.0985
irintensity: 4.6475 0.4084 0.5577 1.9384 0.8372 0.9961 2.3613 2.1828 1.5614 0.6825 6.9757 7.7652 7.8190 9.5970 3.9561 13.1528 18.1828 0.3404 18.9888 19.2651 13.6497 26.8489 4.3441 3.2617 1.2478 2.0011 56.3245 3.3845 14.5748 16.6194 56.3231 7.7616 31.4998 26.4393 32.1985 46.9818 4.9270 83.5668 10.6444 50.1013 126.5195 69.9386 33.1651 7.7120 16.6500 6.2947 15.4832 0.2466
temp: 298.150 k
press: 1.00000 atm
elementType: 16 7 7 7 7 6 6 6 6 6 6 6 1 1 1 1 1 1
symmnumber: 1
zpe: 337354.1 jmol-1
zpe.correction: 0.128491 hartree
zpe.thermalcorrener: 0.137123 hartree
zpe.thermalcorrenthalpy: 0.138067 hartree
zpe.thermalcorrgfe: 0.094479 hartree
zpe.sumelectzpe: -886.551991 hartree
zpe.sumelectthermal: -886.543359 hartree
zpe.sumelectthermalent: -886.542415 hartree
zpe.sumelectthermalfe: -886.586004 hartree
dipole: -6.3577 3.6429 0.0790
dipole: 7.3279
quadrupole: -83.1940 -75.5718 -76.4407
quadrupole: -12.9438 -1.4408 -0.5530
quadrupole: -4.7918 2.8303 1.9614 -12.9438 -1.4408 -0.5530
hfenergy: -886.6804824 hartree
pointgroup: C01 [X(C7H6N4S1)]
dipole: 2.8193323 -0.6019249 0.0272824 debye
dipolederiv: -0.6363033 -0.1728616 -0.0063699 -0.1652557 -0.0317244 -0.0748258 0.0704436 -0.0114839 -0.0447485 -0.7467865 0.0116674 0.036807 -0.1918287 -0.4449831 0.0045942 -0.0218443 -0.0204783 -0.125736 -0.612819 -0.0095499 0.0245194 0.230025 -0.4285869 -0.0207189 0.007948 0.0058471 -0.2684756 -1.0365965 0.0066048 0.0040899 0.1552022 -0.43732 0.000468 -0.021824 -0.016626 -0.1707732 -0.519199 -0.0232483 0.0100269 0.0875805 -0.4461594 -0.000842 0.0125489 0.0233929 -0.1978267 0.550235 0.0616968 -0.0746858 0.1107007 0.0448098 -0.0417897 -0.0647179 0.038228 0.2641185 -0.1978351 -0.5410358 -0.0020094 -0.5019181 -0.4575509 0.0386851 0.0822164 0.0899967 0.1241977 0.1297777 -0.1605221 0.0779126 -0.2256503 0.0863988 -0.0517356 0.0222177 -0.0777958 0.1009283 1.3282162 0.3044666 -0.0242886 0.3562913 0.5379633 0.0285826 -0.0599725 0.0201169 -0.0024849 0.4163297 0.1470402 -0.007616 -0.3759923 0.6044012 0.0198013 0.0036491 -0.0253344 0.0912176 0.6481788 0.2689163 -0.0533353 0.2930752 0.3636584 -0.0268077 -0.0351484 -0.0342188 -0.041405 0.6915191 -0.0481666 -0.0174667 -0.0126676 0.4121983 -0.0239884 -0.0295918 -0.0358046 -0.0526176 -0.026061 -0.0099762 0.0089784 -0.0731386 0.0821436 0.013876 0.0846419 -0.0285236 -0.0887711 0.004836 0.0226702 -0.0189814 0.1290554 -0.0654133 0.0544293 -0.0501255 0.036718 0.0795205 0.0658611 0.0320142 0.0308153 0.0893614 0.0078224 0.0642248 -0.0276078 0.0217513 -0.0857728 -0.0826922 -0.0293139 0.0054532 -0.0280493 0.0710755 0.0189669 0.0182482 0.0046338 0.1137261 0.0579348 0.0708737 0.0044234 0.0454925 0.0593992 -0.00403 0.0038864 0.0033355 0.1719034 -0.0345959 0.0687243 0.001727 0.0777164 0.0418677 0.0011098 0.0050319 0.0062449 0.1329992 unknown
polarizability: 148.0199263|-3.111536|133.6872502|-0.9661883|-3.4056227|55.1350187 unknown
InChI: InChI=1S/C7H6N4S/c1-2-12-7-5-6(8-3-9-7)10-4-11(1)5/h3-4H,1-2H2
charge 0 multiplicity 1
18 atoms
S  1.707044 2.084497 -0.174867
N  0.964314 -1.099419 -0.062911
N  -1.073403 -2.165917 0.077521
N  -1.086037 2.002415 -0.047881
N  -2.446824 -0.060352 0.091007
C  2.390665 -0.76417 -0.233878
C  -0.010439 -0.11076 -0.017591
C  2.704607 0.578982 0.465137
C  0.059626 1.287709 -0.066589
C  -1.274693 -0.769065 0.063396
C  0.264285 -2.316053 -0.007624
C  -2.2732 1.28955 0.026651
H  2.635873 -0.703504 -1.310393
H  3.007969 -1.56086 0.220797
H  2.521015 0.507608 1.549056
H  3.755574 0.855968 0.2870
H  0.77291 -3.278217 -0.026835
H  -3.181185 1.898687 0.027606
