program: Gaussian 09
title: 000235929
version: EM64L-G09RevD.01
frameworkgroup: C1[X(C8H7F2N3O3)]
method: RPBEPBE
basis: SDD
operation: Freq
keyword: #p
keyword: freq=noraman
keyword: PBEPBE/SDD
title: #p freq=noraman PBEPBE/SDD
converged: YES YES NO NO
title: Mulliken charges:
elementType: F F O O O N N N C C C C C C C C H H H H H H H
charge: -0.164894 -0.202693 -0.251836 -0.250542 -0.215101 -0.443709 0.029099 -0.642970 0.183861 0.229419 0.144101 0.319467 0.237754 -0.522494 0.217204 -0.769779 0.290052 0.349160 0.375073 0.342997 0.256196 0.259595 0.230038
chargesum: 0.00000
title: Mulliken charges with hydrogens summed into heavy atoms:
elementType: F F O O O N N N C C C C C C C C
charge: -0.164894 -0.202693 -0.251836 -0.250542 -0.215101 -0.094548 0.029099 0.075100 0.183861 0.229419 0.144101 0.319467 0.237754 -0.232442 0.217204 -0.023950
polarizability: 1.97120633e+02 2.27955873e+00 1.48108786e+02 -7.77493663e+00 -2.25579946e+00 6.25585202e+01
1716.lowfreq: -4.7346 -4.1135 0.0006 0.0009 0.0012 6.9048 52.7999 59.0442 71.5200
frequency: 52.7891 59.0378 71.5177 84.8850 107.2301 122.8308 172.5923 205.3657 243.3457 287.8167 295.1586 301.9364 331.4199 368.2258 379.9064 397.1040 408.9900 442.2372 475.1705 501.4789 557.5013 567.4981 580.4220 651.2662 653.1928 666.4899 689.3517 699.0756 703.2046 734.1634 789.9518 859.9841 867.0189 884.1736 960.0304 988.5594 1038.6650 1088.1717 1110.3796 1166.1956 1194.7139 1228.0394 1249.3906 1286.1055 1341.4604 1381.6738 1385.2867 1421.5376 1447.1015 1464.6915 1481.4891 1520.2723 1562.0594 1591.3273 1634.6227 1646.5641 2994.9707 3082.4207 3129.7606 3194.1813 3396.0895 3444.1172 3641.9377
redmass: 1.8430 1.9845 6.2093 3.9276 9.6341 8.3811 8.4853 10.1521 8.6403 10.5330 6.4793 6.6917 6.4162 3.6920 9.3418 8.5573 12.1737 6.0007 4.6998 6.1601 1.1611 4.2687 3.9994 6.2896 4.9301 5.3509 3.2782 1.1829 4.3118 2.3294 5.4873 1.5132 4.1732 4.8386 4.8738 1.7803 1.6901 2.3227 2.6520 10.4674 2.4570 2.1950 7.0770 5.9653 4.8821 6.0111 1.2241 5.4509 1.1202 1.1339 1.9414 3.2442 1.6262 4.8180 7.6180 6.0919 1.0376 1.0980 1.0993 1.0940 1.0768 1.0504 1.0997
irintensity: 0.9371 2.3001 0.6995 6.8564 3.0910 1.1374 5.5749 0.2954 4.7442 2.9791 0.3146 3.9366 1.6598 9.4287 0.2771 2.5707 1.6186 3.2455 8.5812 22.0110 149.1525 6.1179 0.7036 13.1409 6.8920 10.6715 3.4071 154.4633 38.0541 65.9091 9.1914 27.5817 20.6763 13.6743 16.0904 44.0938 34.6752 91.4487 4.3941 113.1939 58.5622 45.4964 481.6430 243.0621 68.3612 31.5281 62.5119 299.3639 55.2394 52.1022 344.0589 119.7361 172.8431 55.9822 112.3919 88.4922 5.2416 11.2239 9.3493 3.1780 85.2359 111.5646 105.0647
temp: 298.150 k
press: 1.00000 atm
elementType: 9 9 8 8 8 7 7 7 6 6 6 6 6 6 6 6 1 1 1 1 1 1 1
symmnumber: 1
zpe: 402448.6 jmol-1
zpe.correction: 0.153285 hartree
zpe.thermalcorrener: 0.168004 hartree
zpe.thermalcorrenthalpy: 0.168948 hartree
zpe.thermalcorrgfe: 0.111178 hartree
zpe.sumelectzpe: -897.429901 hartree
zpe.sumelectthermal: -897.415182 hartree
zpe.sumelectthermalent: -897.414238 hartree
zpe.sumelectthermalfe: -897.472007 hartree
dipole: -2.1484 0.1378 -1.3355
dipole: 2.5334
quadrupole: -76.4663 -103.0395 -93.7960
quadrupole: 7.3723 -5.1906 3.3650
quadrupole: 14.6343 -11.9389 -2.6954 7.3723 -5.1906 3.3650
hfenergy: -897.5831858 hartree
pointgroup: C01 [X(C8H7F2N3O3)]
dipole: -0.8479515 0.0217945 -0.5234221 debye
dipolederiv: -0.4979789 0.4042725 0.2016805 0.2650612 -0.4771896 -0.1510528 0.0807681 -0.2079156 -0.1913856 -0.8836615 -0.4120925 0.0498387 -0.413259 -0.4435728 0.0162813 0.0695296 0.0419395 -0.1354613 -0.5929517 0.4361695 0.1477326 0.2392676 -0.6987456 -0.0702251 0.2013692 -0.1323252 -0.3182392 -0.7248699 -0.3522247 0.1523145 -0.2302735 -0.6656877 0.0824309 0.2158721 0.1099933 -0.3144924 -0.7140279 -0.05012 -0.0061773 0.4426837 -0.5433634 0.3564304 -0.3705169 0.224412 -0.5662028 -2.0193362 -0.0168729 -0.2587026 0.0326795 -0.3673645 0.0556051 -0.407211 0.053984 -0.5173412 0.8806698 0.0145669 -0.3269741 0.0653507 1.7957628 -0.0046537 -0.3773237 0.0666978 0.320721 -1.3203752 0.1949147 0.1105526 0.5591756 -0.3413005 -0.008055 0.0907622 0.0252763 -0.607016 0.851698 -0.1385142 0.0512035 0.9288258 0.3827806 0.088145 0.0009428 0.1829374 0.0676352 -0.2337308 -0.0082323 0.0346918 -0.1182328 -0.9270123 -0.0050169 -0.1117125 -0.0840702 -0.032876 0.9514603 -0.0359255 -0.1191833 -1.0711934 0.3271718 0.1033406 -0.1994426 -0.0752845 0.1678102 0.2713595 -0.5221064 -0.2509476 -1.0368997 0.1836087 0.1707318 -0.0169515 0.2153868 0.1455293 0.5571226 0.3990127 -0.0816952 1.2841098 0.3988493 -0.0819406 0.0856356 -0.0281038 0.0194502 0.475786 0.1814382 0.0238759 0.0066373 0.0045997 0.0105089 -0.077869 -0.0432671 -0.0861189 2.1362028 0.1208444 0.311353 -0.5994454 0.5951984 -0.5777554 0.6405879 -0.3873694 0.698173 -0.392656 -0.1820734 0.0566051 -0.1523852 -0.0408251 0.0480724 0.1702625 0.0985018 -0.0281723 0.1296468 0.0016211 0.0057852 -0.0114285 0.0664386 -0.0170494 -0.0116092 -0.0159554 0.1870493 0.2972315 -0.0276374 -0.06327 -0.1456306 0.2408849 0.0296641 0.072733 -0.0045393 0.3323252 0.3128231 -0.0687317 -0.0063886 -0.0520043 0.2369617 -0.0249559 0.0162483 -0.0168751 0.3743028 0.3636409 -0.0122606 0.0039084 0.0049789 0.1970927 -0.0253279 0.0069024 -0.0028875 0.3729859 0.0479392 -0.0095984 0.0488571 -0.0012931 0.0692529 -0.0705037 0.0718902 -0.0553142 -0.0136012 0.0299201 -0.0113284 -0.0728403 -0.0048882 0.1004867 0.0409953 -0.1347172 0.0039672 0.0051285 0.0740872 0.0948787 -0.0122198 0.0081636 -0.0940273 0.0343305 -0.0161505 0.0308111 0.1197962 unknown
polarizability: 196.5496906|5.9838669|148.7179159|-7.5658008|1.4329732|62.5203328 unknown
InChI: InChI=1S/C8H7F2N3O3/c1-3(14)12-7-5(10)2-4(9)6(11)8(7)13(15)16/h2,12H,11H2,1H3
charge 0 multiplicity 1
23 atoms
F  1.475547 -2.184235 -0.788734
F  -3.251713 -2.044897 0.110197
O  -1.782543 2.80646 0.407911
O  0.32948 2.79368 -0.417915
O  2.869096 -0.909171 1.127951
N  1.728658 0.582366 -0.288416
N  -0.7326 2.149193 -0.010297
N  -3.234046 0.647992 0.329208
C  0.468771 -0.041501 -0.252542
C  -0.76147 0.704467 -0.04854
C  -2.032241 0.028915 0.103511
C  0.356143 -1.436988 -0.415053
C  -2.007926 -1.391374 -0.02424
C  -0.864883 -2.128432 -0.288945
C  2.882807 0.103884 0.384052
C  4.126393 0.938396 0.109378
H  -0.903289 -3.21338 -0.41323
H  1.702755 1.56927 -0.583502
H  -3.231788 1.657664 0.500509
H  -4.081434 0.083968 0.365868
H  4.62596 0.560832 -0.801942
H  4.825009 0.831309 0.952539
H  3.896913 2.007081 -0.047671
