program: Gaussian 09
title: 000235923
version: EM64L-G09RevD.01
frameworkgroup: C1[X(C17H19NOS)]
method: RPBEPBE
basis: SDD
operation: Freq
keyword: #p
keyword: freq=noraman
keyword: PBEPBE/SDD
title: #p freq=noraman PBEPBE/SDD
converged: YES YES NO NO
title: Mulliken charges:
elementType: S O N C C C C C C C C C C C C C C C C C H H H H H H H H H H H H H H H H H H H
charge: 0.124283 -0.431889 -0.387252 0.204992 -0.631444 0.359367 -0.213657 0.361099 0.505566 -0.541149 -0.301143 -0.694516 -0.732650 -0.605367 0.288555 -0.840942 -0.401517 -0.299588 -0.217522 -0.246904 0.335878 0.210284 0.308926 0.266340 0.218322 0.214676 0.247968 0.227698 0.221699 0.207155 0.225896 0.277618 0.229743 0.220874 0.240679 0.241056 0.224900 0.225835 0.356133
chargesum: 0.00000
title: Mulliken charges with hydrogens summed into heavy atoms:
elementType: S O N C C C C C C C C C C C C C C C C C
charge: 0.124283 -0.075757 -0.078326 0.204992 -0.295566 0.359367 -0.003373 0.361099 0.505566 -0.274809 -0.301143 -0.013550 -0.076098 -0.379470 0.288555 -0.112708 -0.160838 -0.058532 0.007378 -0.021069
polarizability: 3.19638469e+02 -4.65469896e+00 1.81954030e+02 -2.70945974e+00 -4.93835207e+00 1.61187767e+02
1716.lowfreq: -6.4245 -2.7873 -0.0013 -0.0010 0.0004 10.6487 26.0470 43.7434 47.9329
frequency: 25.9930 43.6800 47.8695 80.0105 116.5990 156.4413 157.5587 161.0579 175.3927 189.1003 216.1537 225.1616 250.5810 255.2603 276.1915 288.3396 319.7430 331.1601 335.7695 343.5680 369.7398 401.4367 423.7500 430.8750 458.0094 482.1146 510.1243 521.2947 532.5838 542.3333 562.3159 590.5742 617.4652 625.2648 666.5714 674.9673 717.9339 747.3099 768.7419 790.4073 836.6817 842.0103 847.9834 872.4660 883.5810 922.2307 925.8491 939.2134 964.6939 966.9073 972.3085 1018.5718 1023.3395 1036.6968 1040.3516 1083.5966 1096.9953 1114.3698 1118.6404 1135.3820 1156.6075 1168.2898 1176.2983 1207.9794 1233.1001 1245.1558 1257.5183 1276.8316 1282.7390 1305.1354 1323.1099 1341.4488 1369.7056 1383.7768 1392.3133 1398.5711 1403.0603 1413.3575 1439.7543 1448.0579 1463.5688 1463.7218 1469.5202 1474.8016 1481.1522 1486.6801 1489.6422 1495.6475 1582.0676 1591.4891 1593.8381 1621.4221 2967.2760 2974.0278 2979.9317 2980.2094 3050.1320 3070.0048 3074.0118 3077.3662 3082.2271 3087.4532 3093.7468 3107.3663 3129.2375 3140.2404 3152.5183 3167.7112 3180.9594 3541.9352 3579.1554
redmass: 5.3067 4.7762 4.1277 3.0557 3.5451 4.3406 3.5626 5.0731 1.2559 4.6265 3.0093 1.4874 2.7059 2.3864 2.5717 1.1559 3.6215 3.5732 3.9776 4.5181 1.1321 2.0939 2.6772 3.2607 7.0609 4.0301 4.8051 3.3850 5.0706 4.2347 4.1125 2.9983 4.1959 3.5074 5.8198 5.3352 3.7157 1.3135 3.8289 4.6225 1.4227 2.9426 1.6171 3.1381 1.5269 1.2921 1.3917 2.1402 1.4915 1.3147 4.6285 3.4231 1.5220 2.7095 1.5702 1.6501 4.1040 2.4974 1.5369 1.8949 1.6922 1.0674 1.4446 1.6469 2.0900 1.5421 1.5181 1.5135 1.5467 2.8804 1.7578 2.0528 3.3875 1.2026 2.6073 1.2668 1.2201 1.6940 2.2688 1.9830 2.9063 2.4151 1.0805 1.0590 1.2991 1.0902 1.0924 1.0622 6.3413 6.8830 6.7984 5.9506 1.0412 1.0352 1.0369 1.0813 1.0921 1.1000 1.1004 1.0993 1.1001 1.0995 1.0873 1.0912 1.0849 1.0897 1.0947 1.1006 1.0907 1.0769 1.0660
irintensity: 0.2337 0.1927 0.3024 0.2152 4.0242 3.8929 0.0985 2.6948 1.1724 0.9016 3.3967 0.4616 6.4103 7.6004 1.7833 1.9115 2.4715 6.3715 5.6735 0.7471 132.3023 66.8213 15.3282 10.2448 6.4642 0.1793 0.4634 42.4487 41.2785 4.1545 1.9226 25.4191 4.4937 6.2633 15.7704 17.7557 4.9906 92.3465 4.1917 5.8051 20.9024 10.5295 0.2653 6.9156 16.7902 8.4202 4.3371 12.1494 2.8180 0.1525 29.8263 29.3019 13.3382 1.4390 3.2475 28.3870 41.5776 8.2646 12.0874 176.3474 106.7780 0.9724 18.5218 12.1103 7.6258 5.4896 9.9877 13.4373 43.2426 27.4348 25.3039 37.2991 80.6404 15.2566 2.6126 13.4325 9.6930 41.4517 1.4470 43.3649 110.0707 11.0380 4.2173 11.1501 11.5970 6.6485 27.5895 7.2512 1.9323 72.9058 15.6645 150.3639 31.9474 26.7971 30.8958 20.3101 27.8178 1.0475 34.1734 59.3798 40.6607 4.1031 11.9347 22.1098 0.4314 8.5132 22.0830 30.8816 4.1483 16.9148 48.8407
temp: 298.150 k
press: 1.00000 atm
elementType: 16 8 7 6 6 6 6 6 6 6 6 6 6 6 6 6 6 6 6 6 1 1 1 1 1 1 1 1 1 1 1 1 1 1 1 1 1 1 1
symmnumber: 1
zpe: 831064.8 jmol-1
zpe.correction: 0.316536 hartree
zpe.thermalcorrener: 0.335838 hartree
zpe.thermalcorrenthalpy: 0.336783 hartree
zpe.thermalcorrgfe: 0.269381 hartree
zpe.sumelectzpe: -1185.793681 hartree
zpe.sumelectthermal: -1185.774378 hartree
zpe.sumelectthermalent: -1185.773434 hartree
zpe.sumelectthermalfe: -1185.840835 hartree
dipole: 0.7704 -2.0762 1.4332
dipole: 2.6378
quadrupole: -124.8870 -113.6739 -126.8906
quadrupole: -3.5104 -2.6187 -0.5625
quadrupole: -3.0698 8.1432 -5.0734 -3.5104 -2.6187 -0.5625
hfenergy: -1186.1102164 hartree
pointgroup: C01 [X(C17H19N1O1S1)]
dipole: -0.1854098 -0.7767073 -0.6628483 debye
polarizability: 317.209055|16.5622719|182.6507441|8.9370473|8.0619106|162.9204671 unknown
InChI: InChI=1S/C17H19NOS/c1-10(2)13-9-12(19)8-11(3)16(13)17-18-14-6-4-5-7-15(14)20-17/h4-10,17-19H,1-3H3
charge 0 multiplicity 1
39 atoms
S  1.14693 0.349737 1.780723
O  -4.796452 -2.232334 -0.453116
N  1.285801 0.095024 -0.987834
C  -1.054801 -0.260293 -0.156959
C  0.252257 0.484921 -0.050895
C  -2.281608 0.481717 -0.294482
C  -2.304625 2.021635 -0.295298
C  -1.095132 -1.692545 -0.110082
C  2.616027 0.278306 -0.525924
C  -3.503435 -0.216373 -0.392881
C  2.74251 0.438078 0.888847
C  -2.176093 2.561341 1.159875
C  -3.550283 2.636697 -0.976738
C  -2.339603 -2.358094 -0.204837
C  -3.534078 -1.623524 -0.350485
C  0.146761 -2.557733 0.065081
C  3.764461 0.273358 -1.343922
C  4.01279 0.575378 1.477251
C  5.042714 0.407207 -0.747801
C  5.167043 0.560796 0.651369
H  0.11515 1.572269 -0.077012
H  -1.428621 2.382086 -0.870383
H  1.089527 -0.697529 -1.601884
H  -4.451548 0.313219 -0.50735
H  -3.043207 2.235363 1.763704
H  -2.151342 3.666904 1.160591
H  -1.261391 2.197149 1.661161
H  -3.70498 2.230696 -1.992702
H  -3.422394 3.731407 -1.059697
H  -4.470365 2.460915 -0.389271
H  -2.365108 -3.455206 -0.156989
H  0.892011 -2.076316 0.720094
H  -0.126692 -3.52981 0.511348
H  0.640587 -2.780509 -0.901693
H  3.659851 0.181422 -2.4305
H  4.112532 0.6877 2.561615
H  5.936558 0.405261 -1.381029
H  6.156772 0.673774 1.106689
H  -4.718726 -3.217597 -0.405584
