program: Gaussian 09
title: 000020677
version: EM64L-G09RevD.01
frameworkgroup: C1[X(C9H18Br2)]
method: RPBEPBE
basis: SDD
operation: Freq
keyword: #pfreq=noraman
keyword: PBEPBE/SDD
title: #p freq=noraman PBEPBE/SDD
converged: NO YES NO NO
title: Mulliken charges:
elementType: Br Br C C C C C C C C C H H H H H H H H H H H H H H H H H H
charge: -0.047313 -0.047449 -0.380740 -0.377048 -0.377046 -0.375908 -0.376018 -0.313798 -0.313665 -0.695371 -0.695460 0.195000 0.195280 0.199103 0.198859 0.199101 0.198979 0.197982 0.198488 0.198505 0.198127 0.227107 0.227277 0.227196 0.227134 0.277957 0.277862 0.277858 0.278001
chargesum: 0.00000
title: Mulliken charges with hydrogens summed into heavy atoms:
elementType: Br Br C C C C C C C C C
charge: -0.047313 -0.047449 0.009539 0.020913 0.021035 0.020562 0.020615 0.140587 0.140665 -0.139552 -0.139601
polarizability: 2.01820817e+02 -3.50036211e-03 1.05502599e+02 2.30493668e-02 -9.14413875e-02 8.60020546e+01
1716.lowfreq: -2.7332 -0.0004 -0.0003 -0.0001 5.8936 18.4036 24.6213 44.5611 50.6129
frequency: 24.5979 34.6748 44.5520 70.7991 80.6433 91.2937 106.5217 114.0683 132.7375 153.6358 160.4404 181.6311 216.2753 310.3406 347.1204 440.3498 468.7577 614.1732 624.5826 728.2946 735.4327 746.4635 761.7471 798.3789 858.2343 927.4672 981.5658 988.9148 992.0846 1026.2762 1038.3120 1046.6815 1062.1463 1068.6519 1068.8922 1079.4849 1092.6087 1192.5906 1198.6264 1217.4818 1223.6635 1240.2566 1255.8081 1272.4333 1279.0106 1286.8230 1291.5316 1301.5394 1302.5613 1304.1376 1330.0918 1344.4435 1353.6831 1357.3534 1450.8508 1450.9535 1463.5948 1464.6928 1468.1079 1470.1526 1477.5667 1485.5875 1490.6613 2954.0323 2956.7219 2958.4702 2964.0494 2970.0252 2990.2085 2996.9346 2997.0851 2998.3686 3007.6042 3025.6762 3041.2785 3043.9093 3044.0053 3059.2244 3060.4554 3128.6427 3128.6924
redmass: 7.4907 3.3464 3.4806 2.0351 5.0836 2.2444 17.0077 2.2135 1.9568 2.1801 2.0251 4.2645 5.8829 3.9289 4.0691 3.5085 3.2924 5.1282 4.6954 1.0635 1.0740 1.0844 1.1320 1.2086 1.2569 1.2558 5.5075 5.1634 1.2009 4.2314 3.9798 1.1010 1.0160 2.9234 2.6798 2.3096 4.0588 1.7503 1.1589 1.1979 1.4683 1.2276 1.3138 1.2604 1.1451 1.0687 1.0792 1.1125 1.0979 1.2977 1.3609 1.4569 1.5246 1.6178 1.1018 1.1021 1.0736 1.0711 1.0637 1.0867 1.0976 1.1007 1.1009 1.0588 1.0584 1.0589 1.0593 1.0586 1.0971 1.0595 1.0595 1.0993 1.1024 1.1047 1.1049 1.0563 1.0563 1.1043 1.1042 1.1111 1.1111
irintensity: 0.8715 0.0440 0.0001 0.0015 1.0879 1.6267 0.0007 0.0043 0.0000 0.0001 0.1080 1.3127 7.1192 0.0383 0.3090 1.2643 7.8248 71.2510 5.7953 13.6666 0.0003 14.7207 0.0008 3.1743 0.0003 1.8570 0.0004 13.3019 0.0162 0.9786 0.1251 2.9807 0.0016 10.1436 0.2897 1.9086 0.0731 0.4898 5.5899 22.7969 0.0025 55.7794 1.5773 12.7917 0.0034 0.0052 0.8629 0.1739 0.0678 39.3129 3.2717 5.0881 0.1303 2.6011 0.9221 4.5280 0.1106 1.3740 0.0272 0.4659 2.6986 0.0143 30.9928 1.1799 0.3241 5.1533 0.1913 139.3580 0.9324 1.8185 50.0833 0.0430 2.8091 0.0123 78.8720 13.1969 37.6492 0.1006 130.3816 6.6983 32.3991
temp: 298.150 k
press: 1.00000 atm
elementType: 35 35 6 6 6 6 6 6 6 6 6 1 1 1 1 1 1 1 1 1 1 1 1 1 1 1 1 1 1
symmnumber: 1
zpe: 661046.9 jmol-1
zpe.correction: 0.251779 hartree
zpe.thermalcorrener: 0.266803 hartree
zpe.thermalcorrenthalpy: 0.267747 hartree
zpe.thermalcorrgfe: 0.204860 hartree
zpe.sumelectzpe: -379.762597 hartree
zpe.sumelectthermal: -379.747573 hartree
zpe.sumelectthermalent: -379.746629 hartree
zpe.sumelectthermalfe: -379.809517 hartree
dipole: -0.0013 2.2650 -0.0010
dipole: 2.2650
quadrupole: -143.2812 -87.6565 -87.9220
quadrupole: 0.0052 -0.0083 -0.0074
quadrupole: -36.9946 18.6301 18.3646 0.0052 -0.0083 -0.0074
hfenergy: -380.0143764 hartree
pointgroup: C01 [X(C9H18Br2)]
dipole: 0.0007645 -0.8905647 -0.0315718 debye
polarizability: 201.8196043|0.0381956|105.4723566|-0.373336|0.7728217|86.0335088 unknown
InChI: InChI=1S/C9H18Br2/c10-8-6-4-2-1-3-5-7-9-11/h1-9H2
charge 0 multiplicity 1
29 atoms
Br 6.809189 0.615052 0.007774
Br -6.812683 0.60968 0.049436
C  -0.001197 -0.520713 -0.001796
C  1.287535 0.331812 0.027899
C  -1.29044 0.330716 0.035823
C  2.577624 -0.520616 -0.011344
C  -2.579694 -0.523225 0.002244
C  3.859776 0.35139 0.018396
C  -3.862352 0.347728 0.041982
C  5.117335 -0.51823 -0.029894
C  -5.119891 -0.522224 -0.001064
H  -0.003562 -1.150429 -0.916154
H  0.00184 -1.221017 0.859648
H  1.291599 0.961091 0.941999
H  1.285285 1.031644 -0.833362
H  -1.290333 0.958413 0.951005
H  -1.29326 1.031997 -0.824147
H  2.573352 -1.148125 -0.926861
H  2.580583 -1.21983 0.85056
H  -2.576969 -1.224104 0.862755
H  -2.580352 -1.148957 -0.914423
H  3.857072 1.048771 -0.840814
H  3.870072 0.969626 0.936184
H  -3.867604 0.963203 0.961692
H  -3.865406 1.047654 -0.815124
H  5.210278 -1.181949 0.844386
H  5.196183 -1.101157 -0.961328
H  -5.204154 -1.102941 -0.933422
H  -5.208026 -1.187862 0.87225
