program: Gaussian 09
title: 000020666
version: EM64L-G09RevD.01
frameworkgroup: C1[X(C6H13NOS)]
method: RPBEPBE
basis: SDD
operation: Freq
keyword: #p
keyword: freq=noraman
keyword: PBEPBE/SDD
title: #p freq=noraman PBEPBE/SDD
converged: YES YES NO NO
title: Mulliken charges:
elementType: S O N C C C C C C H H H H H H H H H H H H H
charge: -0.024238 -0.246849 -0.095007 -0.338859 -0.354649 -0.260548 -0.317225 -0.313034 -0.720466 0.193991 0.203869 0.214520 0.193678 0.184712 0.225749 0.193901 0.215230 0.215188 0.194151 0.280675 0.262322 0.092888
chargesum: 0.00000
title: Mulliken charges with hydrogens summed into heavy atoms:
elementType: S O N C C C C C C
charge: 0.068651 -0.246849 -0.095007 0.059001 0.053549 0.149913 0.091907 0.096305 -0.177469
polarizability: 1.14000280e+02 4.08122736e-01 8.07594063e+01 -3.71050787e+00 2.36405888e+00 7.46839021e+01
1716.lowfreq: -24.7727 -8.2838 -0.0026 -0.0022 -0.0021 14.6537 50.8505 59.4443 100.7192
frequency: 50.6808 59.2538 100.6576 193.1910 226.3539 237.7329 240.6477 321.0735 353.6408 401.8040 451.8911 467.8213 594.9808 679.9659 731.9781 770.8067 807.0245 830.1210 842.9651 897.9038 992.5405 1025.7945 1036.2082 1053.2396 1063.0592 1084.5697 1103.2992 1128.3465 1132.7186 1190.4408 1203.7759 1241.7774 1263.7584 1269.9323 1293.1826 1296.8055 1328.2584 1341.8105 1354.8335 1371.5592 1384.8896 1443.8349 1445.7548 1451.2358 1451.6066 1459.1064 1472.2324 2429.0101 2855.1451 2861.4969 2875.5238 2955.2273 2959.2521 3030.1797 3033.8964 3038.9295 3045.1895 3080.9424 3084.1157 3118.3376
redmass: 3.0230 3.2521 3.3530 2.4965 1.4985 3.1614 1.8096 2.2986 3.0847 1.9726 6.5805 2.8097 1.9365 3.2173 1.2590 3.2005 3.8035 1.2743 1.5147 2.2796 2.8221 2.1881 2.0173 1.9077 2.5926 3.5889 2.1291 2.1510 2.4863 1.0641 1.3598 1.1942 1.3713 1.2815 1.2385 1.2345 1.2772 1.2322 1.3797 1.2653 1.4256 1.0817 1.0802 1.0835 1.0930 1.0947 1.0942 1.0383 1.0710 1.0702 1.0691 1.0665 1.0665 1.0892 1.0819 1.0820 1.0728 1.0962 1.0980 1.1065
irintensity: 2.7249 0.3483 3.1321 3.1550 20.9166 8.3400 4.7093 13.9243 4.8746 1.3132 2.5981 1.0577 6.3016 18.4129 1.8931 7.8770 23.7865 6.9586 2.6760 10.2288 33.5438 9.2509 9.0284 18.4154 8.4655 42.5069 7.5280 42.7148 38.0308 1.7665 3.5202 13.9754 8.3781 5.1564 1.8185 16.2581 6.1753 9.7381 0.8821 1.8878 0.8420 2.9622 2.3487 6.8991 13.6847 3.8825 13.9504 30.6448 33.8384 59.1652 157.5742 28.9985 106.8814 37.8181 15.0821 19.7664 44.6638 41.2965 33.9368 14.8392
temp: 298.150 k
press: 1.00000 atm
elementType: 16 8 7 6 6 6 6 6 6 1 1 1 1 1 1 1 1 1 1 1 1 1
symmnumber: 1
zpe: 487551.9 jmol-1
zpe.correction: 0.185699 hartree
zpe.thermalcorrener: 0.195754 hartree
zpe.thermalcorrenthalpy: 0.196698 hartree
zpe.thermalcorrgfe: 0.149440 hartree
zpe.sumelectzpe: -763.682186 hartree
zpe.sumelectthermal: -763.672131 hartree
zpe.sumelectthermalent: -763.671187 hartree
zpe.sumelectthermalfe: -763.718445 hartree
dipole: 0.1100 0.2410 0.6619
dipole: 0.7129
quadrupole: -82.0203 -58.5048 -62.3185
quadrupole: -3.4664 -5.4453 1.0081
quadrupole: -14.4058 9.1098 5.2960 -3.4664 -5.4453 1.0081
hfenergy: -763.8678847 hartree
pointgroup: C01 [X(C6H13N1O1S1)]
dipole: 0.042804 -0.0817075 -0.264882 debye
dipolederiv: -0.3314049 -0.0984857 -0.0375251 -0.115411 -0.1830323 0.120269 -0.1369599 0.1513544 0.0547085 -0.5728725 -0.0365263 -0.0717925 -0.045179 -0.7874676 -0.0369484 -0.0738372 -0.0387017 -0.4203345 -0.9198412 -0.0254727 -0.0075572 -0.0349793 -0.4853326 0.0130089 -0.016688 -0.0082661 -0.530684 -0.0033052 -0.1261679 -0.1170337 -0.1624081 0.3161024 0.0772771 -0.1592167 0.0945463 0.3945266 0.1639283 0.2436819 -0.0850789 0.3174155 0.2747612 -0.055468 -0.0893433 -0.0715824 0.3358147 0.5911094 -0.0673634 0.0799775 0.0713561 0.0672989 0.0344137 -0.0329914 0.0224619 0.3453912 0.4113775 0.2200578 0.0344493 0.1196603 0.5017545 -0.0204461 0.0622611 -0.0977961 0.3550581 0.2758485 -0.146782 -0.0009072 -0.0727814 0.5615351 0.0593708 0.0724073 0.1268187 0.3960002 0.3652639 -0.0467938 0.0316009 -0.0655845 0.1028524 -0.0035015 0.2333594 -0.0249232 0.0646575 0.0108169 0.0539111 0.0025996 0.0629806 -0.001864 0.0642996 0.0507191 -0.0921638 -0.2596012 -0.0083479 -0.1587538 0.0189009 -0.1102281 -0.0726588 0.0152686 0.0336157 0.0283516 0.0547807 0.0379972 0.1116089 0.0430064 0.032343 -0.1185182 -0.0678234 0.0375565 -0.0812565 0.040455 -0.0382483 -0.0605463 -0.010719 -0.0830468 0.0034124 0.0073303 0.0854746 0.1512986 -0.2375471 -0.0825045 0.0096299 -0.0109626 -0.0411151 0.0496447 -0.0596259 -0.1305125 0.0071922 -0.2323786 0.046207 0.0166558 0.0017911 0.0360938 -0.121011 -0.0153776 0.0008086 -0.0364397 0.0617174 0.0167797 -0.0756318 0.0203727 -0.0455369 0.022906 -0.0049286 -0.0073388 0.1229501 -0.1992201 -0.0020628 0.0690798 0.0239482 0.0619037 -0.1163962 -0.0599879 0.0490327 -0.1059144 0.0533683 -0.0688707 -0.1092334 0.0117905 -0.1016456 -0.0808057 0.0066713 0.0514444 0.0419324 0.0820218 0.0595356 0.0599301 0.0472158 0.0423534 -0.0003947 0.0529278 -0.0295012 -0.0573173 -0.2171318 0.0438965 0.0018159 -0.0385643 0.0137585 0.0930675 -0.0324555 0.0160743 -0.0125409 -0.0711075 -0.0261252 0.0883404 -0.0234627 0.0503386 -0.125064 0.0126229 0.000007 -0.0301802 0.0682393 0.0308228 0.0770453 0.0879501 0.0697121 0.0992099 -0.1068969 -0.0163715 -0.089824 -0.1387345 unknown
polarizability: 113.9074508|-1.4311047|80.5370413|3.9684192|2.5785233|74.9990964 unknown
InChI: InChI=1S/C6H13NOS/c9-6-3-7-1-4-8-5-2-7/h9H,1-6H2
charge 0 multiplicity 1
22 atoms
S  -4.248268 0.147323 0.007897
O  2.805603 -0.290021 -0.15277
N  -0.047119 0.205278 0.107969
C  0.467328 -1.064967 -0.467447
C  0.908834 1.312716 -0.158858
C  -1.431764 0.520874 -0.317425
C  1.855397 -1.381952 0.114091
C  2.288879 0.963049 0.422839
C  -2.464755 -0.301137 0.474396
H  0.543622 -1.000456 -1.582904
H  -0.224221 -1.891497 -0.220517
H  0.531272 2.236038 0.319709
H  1.016761 1.509554 -1.255382
H  -1.579898 0.358008 -1.415794
H  -1.621417 1.592827 -0.125359
H  1.769322 -1.544928 1.210165
H  2.29198 -2.275794 -0.361411
H  3.034882 1.734515 0.170047
H  2.211002 0.86409 1.527115
H  -2.388509 -0.075313 1.549622
H  -2.336361 -1.386567 0.334517
H  -4.174472 -0.29794 -1.3034
