program: Gaussian 09
title: 000000757
version: EM64L-G09RevD.01
frameworkgroup: C1[X(C2H4O3)]
method: RPBEPBE
basis: SDD
operation: Freq
keyword: #p
keyword: freq=noraman
keyword: PBEPBE/SDD
title: #p freq=noraman PBEPBE/SDD
converged: YES YES NO NO
title: Mulliken charges:
elementType: O O O C C H H H H
charge: -0.445385 -0.396479 -0.253375 -0.329310 0.181201 0.244518 0.245493 0.363364 0.389973
chargesum: 0.00000
title: Mulliken charges with hydrogens summed into heavy atoms:
elementType: O O O C C
charge: -0.082021 -0.006505 -0.253375 0.160700 0.181201
polarizability: 3.81888868e+01 -9.39876961e-01 3.67911266e+01 -8.29361430e-03 9.74674618e-03 1.92589895e+01
1716.lowfreq: -0.0008 -0.0007 0.0006 2.7377 5.8741 11.8168 65.0014 255.6504 291.4952
frequency: 64.9900 255.6498 291.4905 438.9188 490.0334 599.8306 628.3597 831.9743 1012.5067 1015.7904 1078.7610 1187.3551 1251.9506 1294.9069 1407.8662 1455.8159 1653.3136 2988.4979 3030.7008 3488.8093 3519.3409
redmass: 3.0231 6.0468 1.1150 5.4748 1.7379 5.2109 1.4228 3.8981 5.4281 1.9751 2.1864 1.0726 1.2869 1.8862 1.5217 1.0726 8.2021 1.0581 1.1032 1.0655 1.0643
irintensity: 25.9234 11.0090 118.0261 35.9214 8.8694 8.9666 181.0477 40.1363 249.7938 4.1937 87.3047 2.0624 43.4552 99.7838 25.2537 20.3012 211.7100 33.0708 19.0260 24.8160 31.5329
temp: 298.150 k
press: 1.00000 atm
elementType: 8 8 8 6 6 1 1 1 1
symmnumber: 1
zpe: 167398.6 jmol-1
zpe.correction: 0.063759 hartree
zpe.thermalcorrener: 0.069340 hartree
zpe.thermalcorrenthalpy: 0.070284 hartree
zpe.thermalcorrgfe: 0.034763 hartree
zpe.sumelectzpe: -303.867838 hartree
zpe.sumelectthermal: -303.862257 hartree
zpe.sumelectthermalent: -303.861313 hartree
zpe.sumelectthermalfe: -303.896834 hartree
dipole: 2.5857 -0.7599 0.0304
dipole: 2.6952
quadrupole: -29.5206 -31.4629 -28.6300
quadrupole: -0.3516 -0.0657 0.0089
quadrupole: 0.3506 -1.5918 1.2412 -0.3516 -0.0657 0.0089
hfenergy: -303.9315968 hartree
pointgroup: C01 [X(C2H4O3)]
dipole: 1.0131931 -0.294739 -0.1047363 debye
dipolederiv: -0.5731535 0.234638 0.0366 0.2092917 -0.3990714 0.0116328 0.0347576 0.0084596 -0.5542611 -1.0719133 0.47578 0.1173684 0.3963636 -0.47691 -0.0383162 0.1057113 -0.0442175 -0.4358469 -0.6466491 -0.0700493 0.0153015 0.1774203 -0.9852802 -0.1065416 0.05065 -0.0884083 -0.3358582 0.2278243 -0.3443071 -0.0334406 -0.4671299 0.1732175 0.0025875 -0.0507466 -0.0045495 0.3859269 1.3324865 -0.1664437 -0.1113688 -0.2862079 1.3030436 0.1763494 -0.1283692 0.1677621 0.2373309 0.0308783 0.0551694 -0.0223717 0.0736562 -0.0073498 0.0792251 -0.0324094 0.1240888 -0.0040897 0.0425477 0.0305828 0.0223404 0.052509 0.0478059 -0.0729402 0.0372742 -0.1147296 -0.0634752 0.3871581 -0.1231778 -0.0222257 -0.0270308 0.1671817 -0.0287595 -0.0093558 -0.0220932 0.3608924 0.2708211 -0.0921924 -0.0022036 -0.1288722 0.1773627 -0.0232374 -0.007512 -0.0263123 0.4093809 unknown
polarizability: 38.0710316|-0.7437676|36.4482261|-1.5164784|2.4701249|19.7197452 unknown
InChI: InChI=1S/C2H4O3/c3-1-2(4)5/h3-4H,1H2
charge 0 multiplicity 1
9 atoms
O  -1.97918 -0.036443 0.255287
O  1.624339 -0.701905 -0.10426
O  0.451453 1.278268 0.264061
C  -0.782821 -0.831017 0.063753
C  0.465687 0.0379 0.088434
H  -0.696631 -1.595596 0.860825
H  -0.827781 -1.360947 -0.907592
H  -1.704458 0.912824 0.379163
H  2.421592 -0.106185 -0.081271
