program: Gaussian 09
title: 000235914
version: EM64L-G09RevD.01
frameworkgroup: C1[X(C13H16O4)]
method: RPBEPBE
basis: SDD
operation: Freq
keyword: #pfreq=noraman
keyword: PBEPBE/SDD
title: #p freq=noraman PBEPBE/SDD
converged: YES YES NO NO
title: Mulliken charges:
elementType: O O O O C C C C C C C C C C C C C H H H H H H H H H H H H H H H H
charge: -0.423359 -0.232509 -0.417988 -0.226174 0.144569 -0.428325 -0.608333 0.415046 -0.377677 0.153805 -0.381514 -0.389914 -0.696804 0.164502 -0.255661 -0.249290 -0.240053 0.223782 0.246404 0.265908 0.293617 0.223283 0.196264 0.264223 0.243596 0.216422 0.214048 0.214348 0.228280 0.226397 0.230893 0.381432 0.380781
chargesum: 0.00000
title: Mulliken charges with hydrogens summed into heavy atoms:
elementType: O O O O C C C C C C C C C C C C C
charge: -0.041927 -0.232509 -0.037207 -0.226174 0.144569 0.041862 -0.048809 0.415046 0.041870 0.153805 -0.117291 -0.146318 -0.051986 0.164502 -0.027381 -0.022892 -0.009160
polarizability: 1.76793039e+02 -1.82637602e-01 1.14768338e+02 -2.87344113e+00 4.93982390e+00 1.47558984e+02
1716.lowfreq: -15.8711 -8.7337 -0.0005 -0.0003 0.0004 9.2476 35.4883 48.2630 54.4835
frequency: 35.3939 48.0583 54.2333 62.4732 72.2931 91.9651 99.1549 124.8163 143.2914 206.7887 233.2631 234.1719 270.2948 293.6378 300.8792 329.8374 344.7302 372.2492 404.4078 478.2449 498.7744 518.3583 560.9813 582.1636 600.4656 616.0843 632.3808 647.6950 697.3423 706.4591 729.8270 748.0526 781.8821 812.4875 855.2754 859.2326 878.5025 914.6146 926.3231 942.2041 980.7903 990.3447 998.2419 1005.0207 1029.6388 1037.2289 1054.0201 1081.9679 1095.3097 1108.8451 1121.0763 1159.6301 1175.4191 1189.1516 1206.1975 1237.6773 1246.3828 1267.4162 1281.3196 1301.1999 1304.9168 1330.1133 1352.5791 1356.4642 1379.9312 1392.2527 1431.9412 1437.1641 1470.8910 1477.1343 1477.4664 1485.3737 1489.9609 1590.1053 1609.5323 1650.5916 1667.4864 2969.5415 2975.6227 3010.3723 3017.9020 3020.5365 3065.5118 3074.8148 3075.2016 3077.4061 3124.7484 3132.2390 3144.9653 3157.6501 3168.9541 3512.6844 3521.8212
redmass: 5.6138 4.1151 4.1001 3.8257 2.0588 6.1789 9.2872 5.3454 4.2706 2.9198 2.1209 2.1269 3.4659 3.5882 3.2932 3.9008 3.3731 7.4258 2.8539 2.7605 2.5861 2.1440 3.3933 2.0934 3.0005 5.4103 2.8593 1.5259 5.2273 1.8091 1.4783 1.7448 2.5063 2.3418 1.2473 3.4947 1.6247 1.8648 1.4291 2.9833 1.3967 5.4816 1.3661 2.5899 2.4731 2.5721 2.4948 1.9167 1.9890 1.9426 2.2081 3.4024 1.0695 2.0952 1.1880 1.3493 1.3360 1.4857 1.6198 1.4423 1.3893 1.3676 1.5410 2.1401 5.3318 1.2098 1.4212 1.5372 1.0665 1.0446 1.0628 2.0657 1.0835 5.8532 5.8800 9.3279 8.1830 1.0595 1.0364 1.0616 1.0669 1.0913 1.1016 1.0997 1.0991 1.1009 1.0847 1.0881 1.0934 1.0953 1.0991 1.0639 1.0640
irintensity: 0.1839 0.1525 0.2809 0.1068 0.0682 1.1644 1.6470 0.9586 1.8617 1.4258 0.8745 1.2179 0.9839 0.3234 0.3474 3.3379 8.0813 1.0845 0.0140 3.8996 8.0716 12.6980 72.4954 86.7029 97.0418 8.1253 25.8237 85.9145 24.0028 54.8677 22.7540 10.9306 28.8276 5.4609 0.4525 2.1051 9.6310 28.3058 4.0565 14.3651 0.6141 1.8252 7.2880 132.7965 21.9049 158.4150 89.2474 91.8208 95.0024 7.3730 11.2715 6.4250 0.1048 0.0312 2.3963 0.4746 0.6696 1.6628 27.9249 3.8250 6.3785 1.8302 11.1778 76.9470 6.4098 10.9060 36.7976 11.5051 1.7716 13.0898 5.4454 18.4386 20.2334 3.5474 11.6049 113.8422 239.8003 26.5585 33.3709 13.8896 4.2378 11.3708 0.1553 50.9719 11.3160 61.6737 0.8860 4.2998 16.0598 35.6883 13.5742 28.8080 31.5387
temp: 298.150 k
press: 1.00000 atm
elementType: 8 8 8 8 6 6 6 6 6 6 6 6 6 6 6 6 6 1 1 1 1 1 1 1 1 1 1 1 1 1 1 1 1
symmnumber: 1
zpe: 695210.0 jmol-1
zpe.correction: 0.264792 hartree
zpe.thermalcorrener: 0.281968 hartree
zpe.thermalcorrenthalpy: 0.282912 hartree
zpe.thermalcorrgfe: 0.218870 hartree
zpe.sumelectzpe: -804.620730 hartree
zpe.sumelectthermal: -804.603554 hartree
zpe.sumelectthermalent: -804.602610 hartree
zpe.sumelectthermalfe: -804.666652 hartree
dipole: 0.6393 -0.2052 -2.5626
dipole: 2.6491
quadrupole: -89.7042 -96.8826 -104.0581
quadrupole: 1.2078 5.3596 -0.5839
quadrupole: 7.1774 -0.0009 -7.1765 1.2078 5.3596 -0.5839
hfenergy: -804.8855215 hartree
pointgroup: C01 [X(C13H16O4)]
dipole: -0.2941415 0.0020844 0.999879 debye
polarizability: 176.8545806|-2.8527847|114.3784631|-1.7841237|-2.5797765|147.8873168 unknown
InChI: InChI=1S/C13H16O4/c1-2-8-13(12(16)17,9-11(14)15)10-6-4-3-5-7-10/h3-7,14,16H,2,8-9H2,1H3
charge 0 multiplicity 1
33 atoms
O  0.828261 -2.479616 -0.583707
O  0.596349 -1.122556 -2.444541
O  3.378545 -0.489137 2.110706
O  3.300237 -0.603959 -0.202743
C  0.387298 -0.109532 -0.175811
C  0.787788 1.250803 -0.846781
C  1.202196 -0.376353 1.113966
C  -1.143972 -0.123157 0.110842
C  0.576418 2.497134 0.040133
C  0.633293 -1.237046 -1.201556
C  -2.04592 -0.022905 -0.98291
C  -1.681804 -0.199965 1.420059
C  0.861468 3.79925 -0.740519
C  2.695477 -0.493958 0.885957
C  -3.440162 0.004722 -0.772885
C  -3.079864 -0.169792 1.631967
C  -3.966246 -0.066126 0.538222
H  0.196479 1.360484 -1.773524
H  1.844504 1.186112 -1.165783
H  1.03321 0.42067 1.85808
H  0.881629 -1.324656 1.582907
H  -0.463019 2.515797 0.422283
H  1.24129 2.460843 0.926535
H  -1.654484 0.019707 -2.005721
H  -1.025377 -0.283719 2.291255
H  0.726079 4.6898 -0.099995
H  0.180119 3.897011 -1.606198
H  1.898006 3.813162 -1.126709
H  -4.115589 0.078717 -1.632536
H  -3.472543 -0.228122 2.65342
H  -5.049141 -0.043869 0.702938
H  0.955773 -3.171871 -1.286807
H  4.353402 -0.602178 1.940957
